program: Gaussian 16
title: Title Card Required
version: ES64L-G16RevC.02
basis: 6-31+G(d,p)
method: UwB97XD TD-FC
operation: Force
keyword: #p
keyword: td=(nstates=30,root=2)
keyword: uwb97xd/6-31+g(d,p)
keyword: force
keyword: scrf=(CPCM,solvent=chloroform)
keyword: nosymm
keyword: scf=xqc
keyword: Guess=mix
keyword: density=current
title: #p td=(nstates=30,root=2) uwb97xd/6-31+g(d,p) force scrf=(CPCM,solvent
basis: NPDir=0 NMtPBC= 1 NCelOv= 1 NCel= 1 NClECP= 1 NCelD= 1
basis: NCelK= 1 NCelE2= 1 NClLst= 1 CellRange= 0.0.
basis: One-electron integrals computed using PRISM.
basis: NBasis= 859 RedAO= T EigKep= 1.05D-06 NBF= 859
basis: NBsUse= 853 1.00D-06 EigRej= 9.75D-07 NBFU= 853
converged: NO NO NO NO
hfenergy: -1479.214181 hartree
pointgroup: C01 [X(C32H35N3O1)]
dipole: -4.9973429 -1.822137 -4.2559877 debye
InChI: InChI=1/32C.3N.O.35H
charge 2 multiplicity 1
71 atoms
C  0.2623721 -1.9405335 -0.00606907
C  -0.92683648 -1.78496131 -0.77470993
C  -1.381552 -0.46529642 -1.12729036
C  -0.60805851 0.627875 -0.74778218
C  0.56001042 0.44429246 -0.00917046
C  1.02322671 -0.86253364 0.38286862
C  -0.59976329 -3.98780957 -0.37185597
C  -1.46391712 -3.07418193 -1.00606055
H  -2.31279284 -0.31363355 -1.66118375
H  -0.93046554 1.62939419 -1.0071503
H  1.13993965 1.30523711 0.3026368
H  1.92570083 -0.97551365 0.96268864
N  0.42892408 -3.32658913 0.22797617
H  -0.69610805 -5.0604214 -0.32834748
C  1.54629128 -3.91302912 0.88092241
O  2.37841879 -3.1855053 1.37981919
C  1.68127264 -5.41407901 0.85806473
H  2.28188407 -5.66317431 1.73396192
H  0.72150227 -5.9270182 0.96140763
C  2.42882467 -5.89060772 -0.41511796
H  2.74743489 -6.92074471 -0.22619484
H  3.33556532 -5.29014051 -0.53961856
C  1.59520201 -5.85012269 -1.66468286
H  0.79934742 -6.59290339 -1.73275712
C  1.76531939 -4.98524949 -2.6651689
H  2.55095949 -4.23325594 -2.6376262
H  1.12890598 -5.00641422 -3.54484103
C  -2.68194347 -3.40843331 -1.68190218
H  -3.28863892 -4.25009783 -1.36388541
N  -3.09771584 -2.71473335 -2.74423595
H  -2.50575006 -1.97699027 -3.11214147
C  -2.6161087 -0.4083593 -4.99648074
C  -3.92309452 -0.69781511 -4.5890277
C  -4.71030646 0.32490957 -4.04826279
C  -4.18989572 1.606537 -3.90005571
C  -2.87605717 1.87990943 -4.27922727
C  -2.09058752 0.87217789 -4.83195038
H  -2.0039555 -1.18342786 -5.45075674
H  -5.73271755 0.13818962 -3.73508611
H  -4.81224028 2.39152484 -3.48423636
H  -2.47164736 2.87860444 -4.15433601
H  -1.07375899 1.08028038 -5.14661041
C  -4.40357608 -2.13005637 -4.69726549
H  -3.72265029 -2.67720508 -5.35578334
C  -4.42064609 -2.87759527 -3.32364541
H  -4.55309717 -3.94566399 -3.53001682
C  -5.52564734 -2.44932374 -2.36684573
C  -6.73669472 -3.14674131 -2.35993089
C  -5.3520401 -1.38301111 -1.47981625
C  -7.77537034 -2.75375199 -1.51634775
H  -6.86600945 -4.02409519 -2.98774706
C  -6.38378596 -0.9940156 -0.63367738
H  -4.40745699 -0.85339322 -1.44373043
C  -7.60223069 -1.67120209 -0.6575798
H  -8.70844204 -3.30612596 -1.51873197
H  -6.23314465 -0.16314549 0.0477251
H  -8.40658066 -1.36583891 0.00283456
C  -5.89229157 -1.3540802 -6.59380807
C  -6.12915212 -3.65573761 -5.79503868
C  -6.84911625 -2.12036103 -7.4878919
H  -4.90066763 -1.27474662 -7.04268294
H  -6.22718695 -0.36565104 -6.28662468
C  -6.39218018 -3.56523538 -7.29526036
H  -7.02617983 -3.93337692 -5.24273518
H  -5.32040929 -4.33523505 -5.53191337
H  -7.88311587 -1.98523366 -7.15615493
H  -6.77273083 -1.78038883 -8.52127451
H  -7.1376328 -4.29957113 -7.60197899
H  -5.47305456 -3.75414882 -7.85674586
N  -5.75186736 -2.23500687 -5.3587704
H  -6.45408233 -1.93170766 -4.67691481
