program: Gaussian 16
title: Title Card Required
version: ES64L-G16RevC.02
basis: 6-31+G(d,p)
method: UwB97XD TD-FC
operation: Force
keyword: #p
keyword: td=(nstates=30,root=3)
keyword: uwb97xd/6-31+g(d,p)
keyword: force
keyword: scrf=(CPCM,solvent=chloroform)
keyword: nosymm
keyword: scf=xqc
keyword: Guess=mix
keyword: density=current
title: #p td=(nstates=30,root=3) uwb97xd/6-31+g(d,p) force scrf=(CPCM,solvent
basis: NPDir=0 NMtPBC= 1 NCelOv= 1 NCel= 1 NClECP= 1 NCelD= 1
basis: NCelK= 1 NCelE2= 1 NClLst= 1 CellRange= 0.0.
basis: One-electron integrals computed using PRISM.
basis: NBasis= 859 RedAO= T EigKep= 1.05D-06 NBF= 859
basis: NBsUse= 853 1.00D-06 EigRej= 9.75D-07 NBFU= 853
converged: NO NO NO NO
hfenergy: -1479.2141129 hartree
pointgroup: C01 [X(C32H35N3O1)]
dipole: -4.9939236 -1.8215345 -4.2524228 debye
InChI: InChI=1/32C.3N.O.35H
charge 2 multiplicity 1
71 atoms
C  0.2625866 -1.94039084 -0.00631144
C  -0.9266947 -1.78503467 -0.77457992
C  -1.38142381 -0.46525355 -1.12751759
C  -0.60825833 0.62863309 -0.74787088
C  0.5596679 0.44414981 -0.00830844
C  1.02253377 -0.86228695 0.38295414
C  -0.6002895 -3.98837866 -0.37204877
C  -1.46445546 -3.07401948 -1.0064685
H  -2.31234067 -0.31443688 -1.66130867
H  -0.9311589 1.63013543 -1.00722915
H  1.13933807 1.30535413 0.30307462
H  1.92643504 -0.97577407 0.96307975
N  0.42914118 -3.32650706 0.22808319
H  -0.69593396 -5.06061831 -0.32850183
C  1.54626888 -3.91278873 0.88120249
O  2.3778215 -3.18539344 1.37963924
C  1.6807671 -5.41443464 0.85809535
H  2.2823148 -5.66369066 1.73384166
H  0.72178268 -5.92729951 0.96172342
C  2.42924177 -5.89112172 -0.41511996
H  2.74779916 -6.92085227 -0.22648308
H  3.33565354 -5.2901565 -0.5398667
C  1.59526304 -5.85052505 -1.66445278
H  0.79941565 -6.59285645 -1.73270971
C  1.76495148 -4.98507172 -2.66544777
H  2.55056248 -4.23342253 -2.63735214
H  1.1286031 -5.0064147 -3.54473527
C  -2.68237064 -3.40907207 -1.68216702
H  -3.28911236 -4.2499074 -1.36400012
N  -3.09798919 -2.71286043 -2.74444151
H  -2.50609626 -1.97594605 -3.11102041
C  -2.61625547 -0.4082808 -4.99667602
C  -3.92304959 -0.69790471 -4.58930997
C  -4.71043967 0.32515019 -4.04843337
C  -4.19006651 1.60660798 -3.90027954
C  -2.87602273 1.87995414 -4.27948478
C  -2.09057198 0.87234093 -4.83220518
H  -2.00399337 -1.1832436 -5.45125602
H  -5.73282865 0.13820341 -3.73573516
H  -4.81238827 2.39153028 -3.48448922
H  -2.47160702 2.87867968 -4.15400598
H  -1.07378631 1.0804987 -5.14682059
C  -4.40380153 -2.13010941 -4.69744523
H  -3.72259988 -2.67706052 -5.35584407
C  -4.42091328 -2.8773002 -3.324016
H  -4.55251993 -3.94638684 -3.53008919
C  -5.52548871 -2.4493586 -2.36703903
C  -6.73683048 -3.14691093 -2.35948071
C  -5.3515416 -1.3836122 -1.47988633
C  -7.77482066 -2.75365413 -1.51597626
H  -6.86580455 -4.02414109 -2.98773213
C  -6.38329065 -0.99375615 -0.63342727
H  -4.40689269 -0.85379996 -1.44338757
C  -7.60202774 -1.67096297 -0.65776858
H  -8.70809546 -3.30634647 -1.51838387
H  -6.23276886 -0.16299448 0.04755771
H  -8.40639613 -1.36544551 0.00266655
C  -5.89218553 -1.35411995 -6.59379759
C  -6.12920073 -3.65591943 -5.79490686
C  -6.84906071 -2.12046726 -7.48774374
H  -4.90049177 -1.27486396 -7.04262546
H  -6.22716334 -0.36575746 -6.28651111
C  -6.39218633 -3.56524842 -7.29505342
H  -7.02622466 -3.93340509 -5.24271665
H  -5.32032593 -4.33542126 -5.5318753
H  -7.88307281 -1.98531068 -7.15623736
H  -6.77264857 -1.7804505 -8.52104767
H  -7.13758677 -4.29961277 -7.60188048
H  -5.47311953 -3.75428399 -7.85671329
N  -5.75192343 -2.23505052 -5.35882517
H  -6.45388218 -1.93183355 -4.67670032
