program: Gaussian 16
title: Title Card Required
version: ES64L-G16RevC.02
basis: 6-31+G(d,p)
method: UwB97XD TD-FC
operation: Force
keyword: #p
keyword: td=(nstates=30,root=2)
keyword: uwb97xd/6-31+g(d,p)
keyword: force
keyword: scrf=(CPCM,solvent=chloroform)
keyword: nosymm
keyword: scf=xqc
keyword: Guess=mix
keyword: density=current
title: #p td=(nstates=30,root=2) uwb97xd/6-31+g(d,p) force scrf=(CPCM,solvent
basis: NPDir=0 NMtPBC= 1 NCelOv= 1 NCel= 1 NClECP= 1 NCelD= 1
basis: NCelK= 1 NCelE2= 1 NClLst= 1 CellRange= 0.0.
basis: One-electron integrals computed using PRISM.
basis: NBasis= 859 RedAO= T EigKep= 1.06D-06 NBF= 859
basis: NBsUse= 853 1.00D-06 EigRej= 9.76D-07 NBFU= 853
converged: NO NO NO NO
hfenergy: -1479.2140443 hartree
pointgroup: C01 [X(C32H35N3O1)]
dipole: -3.2950602 -0.2325673 -3.3717284 debye
InChI: InChI=1/32C.3N.O.35H
charge 2 multiplicity 1
71 atoms
C  0.26366151 -1.93864405 -0.00685081
C  -0.92637796 -1.78383822 -0.77503375
C  -1.38048612 -0.46315282 -1.12586543
C  -0.60139507 0.62959847 -0.75298799
C  0.56976505 0.44433069 -0.01917185
C  1.02760318 -0.86240045 0.37842325
C  -0.59931577 -3.98625423 -0.36886042
C  -1.46314058 -3.07401041 -1.00600705
H  -2.31583617 -0.31114138 -1.65196183
H  -0.92178386 1.63124968 -1.01344222
H  1.15628356 1.30423222 0.28294342
H  1.93034475 -0.97783978 0.95954155
N  0.42935809 -3.32366135 0.23000493
H  -0.69516689 -5.05830782 -0.32185907
C  1.54781854 -3.90914199 0.88107136
O  2.38228107 -3.18222442 1.37559855
C  1.67842197 -5.41029285 0.8594139
H  2.27554988 -5.66214447 1.73686629
H  0.71657985 -5.91890194 0.95954053
C  2.42760633 -5.88802579 -0.41285388
H  2.7419973 -6.91889548 -0.22328784
H  3.33636606 -5.29013579 -0.53513536
C  1.59713548 -5.84541548 -1.66465615
H  0.7994619 -6.58581111 -1.73440822
C  1.77266585 -4.98356038 -2.66753204
H  2.56012835 -4.23383648 -2.64009668
H  1.13900972 -5.00653011 -3.54905209
C  -2.68119841 -3.41531321 -1.67968616
H  -3.28527714 -4.25573478 -1.35426563
N  -3.09956418 -2.72538364 -2.74422533
H  -2.4955741 -2.00664178 -3.12745755
C  -2.61465966 -0.41189116 -4.98838224
C  -3.92208877 -0.69989945 -4.58222088
C  -4.70785374 0.32333014 -4.03962417
C  -4.18707081 1.60500222 -3.89398015
C  -2.87425866 1.87819739 -4.27728468
C  -2.08862015 0.86875786 -4.82626402
H  -2.00240349 -1.18796654 -5.44122968
H  -5.72877803 0.13635878 -3.72241038
H  -4.80823063 2.39025112 -3.47703432
H  -2.47097226 2.87811788 -4.15808239
H  -1.07143102 1.07557513 -5.14045847
C  -4.4050218 -2.13094361 -4.69440701
H  -3.72377552 -2.67759013 -5.35315464
C  -4.42526082 -2.88082043 -3.32205004
H  -4.56601821 -3.94829323 -3.53004501
C  -5.52920731 -2.4480383 -2.36590491
C  -6.74073777 -3.14535881 -2.36266957
C  -5.35993848 -1.3799112 -1.48059156
C  -7.78167154 -2.75388512 -1.52230064
H  -6.86758558 -4.02171464 -2.99235951
C  -6.39323523 -0.99545755 -0.63280542
H  -4.41932291 -0.84278489 -1.44718659
C  -7.61025095 -1.67601686 -0.6582541
H  -8.71615704 -3.30472391 -1.53183847
H  -6.24588428 -0.16599942 0.0504573
H  -8.41422301 -1.37661063 0.00542949
C  -5.89205329 -1.35146179 -6.59439945
C  -6.12924719 -3.65369254 -5.79687001
C  -6.84950392 -2.11771524 -7.48852362
H  -4.90060734 -1.27175066 -7.04367312
H  -6.22754445 -0.36326855 -6.28700172
C  -6.39199752 -3.56234927 -7.29695083
H  -7.02614884 -3.93195641 -5.24487985
H  -5.31997806 -4.3328212 -5.53448128
H  -7.88342733 -1.98338406 -7.15621595
H  -6.77445618 -1.77749211 -8.52191813
H  -7.13685511 -4.29705813 -7.60436354
H  -5.47264035 -3.75037171 -7.85854755
N  -5.7522067 -2.23316405 -5.3593521
H  -6.45544822 -1.92965979 -4.67870723
