program: Gaussian 16
title: Title Card Required
version: ES64L-G16RevC.02
basis: 6-31+G(d,p)
method: UwB97XD TD-FC
operation: Force
keyword: #p
keyword: td=(nstates=30,root=3)
keyword: uwb97xd/6-31+g(d,p)
keyword: force
keyword: scrf=(CPCM,solvent=chloroform)
keyword: nosymm
keyword: scf=xqc
keyword: Guess=mix
keyword: density=current
title: #p td=(nstates=30,root=3) uwb97xd/6-31+g(d,p) force scrf=(CPCM,solvent
basis: NPDir=0 NMtPBC= 1 NCelOv= 1 NCel= 1 NClECP= 1 NCelD= 1
basis: NCelK= 1 NCelE2= 1 NClLst= 1 CellRange= 0.0.
basis: One-electron integrals computed using PRISM.
basis: NBasis= 859 RedAO= T EigKep= 1.06D-06 NBF= 859
basis: NBsUse= 853 1.00D-06 EigRej= 9.73D-07 NBFU= 853
converged: NO NO NO NO
hfenergy: -1479.2139437 hartree
pointgroup: C01 [X(C32H35N3O1)]
dipole: -3.2937127 -0.2281351 -3.3677502 debye
InChI: InChI=1/32C.3N.O.35H
charge 2 multiplicity 1
71 atoms
C  0.26386778 -1.93942379 -0.00659412
C  -0.92740097 -1.78440245 -0.77388801
C  -1.38248057 -0.46365784 -1.12580349
C  -0.60384423 0.62776939 -0.75133348
C  0.5667143 0.44289382 -0.01605125
C  1.02729598 -0.86335423 0.38028613
C  -0.59908277 -3.98748688 -0.36903071
C  -1.46313504 -3.07406474 -1.00553314
H  -2.31581601 -0.30838637 -1.65540108
H  -0.92474292 1.62967406 -1.01028293
H  1.149725 1.30329162 0.29012386
H  1.92921197 -0.9766013 0.96290237
N  0.43027407 -3.32456922 0.22947475
H  -0.69612946 -5.05965842 -0.32434533
C  1.54832381 -3.91013232 0.88139565
O  2.38266416 -3.18463038 1.37809173
C  1.67911839 -5.41095288 0.85882297
H  2.27743935 -5.65993002 1.73613843
H  0.71814651 -5.92132909 0.95854921
C  2.42789427 -5.88857251 -0.41358336
H  2.74248853 -6.91924733 -0.2234898
H  3.33561067 -5.28944927 -0.53714547
C  1.59628106 -5.84706415 -1.66450284
H  0.79982629 -6.58875365 -1.73410039
C  1.76966825 -4.98387241 -2.66687211
H  2.55653495 -4.23364299 -2.63980622
H  1.13523741 -5.00653218 -3.5476931
C  -2.67979164 -3.41372626 -1.68149057
H  -3.28349496 -4.25437179 -1.3567719
N  -3.09736932 -2.722952 -2.74645515
H  -2.49749425 -1.99743949 -3.12417953
C  -2.61516144 -0.41081384 -4.99084819
C  -3.92255384 -0.69918733 -4.58450723
C  -4.70877809 0.32394463 -4.04223342
C  -4.18814873 1.60552917 -3.89589129
C  -2.87503004 1.87878657 -4.27816119
C  -2.08925958 0.86987372 -4.82810045
H  -2.00259527 -1.18657807 -5.44382812
H  -5.73001876 0.1369346 -3.72583854
H  -4.80983022 2.39077555 -3.47951009
H  -2.47165924 2.87847463 -4.15767471
H  -1.0722804 1.0773336 -5.14264448
C  -4.40486767 -2.13061162 -4.69543977
H  -3.72334477 -2.67780377 -5.35329246
C  -4.42366239 -2.87987826 -3.32300995
H  -4.56357623 -3.94767304 -3.53027653
C  -5.52763915 -2.44813071 -2.3663298
C  -6.73930948 -3.14553028 -2.36170281
C  -5.3573457 -1.38025863 -1.48086772
C  -7.77969425 -2.7532678 -1.52061416
H  -6.86712378 -4.02249162 -2.99034615
C  -6.39008158 -0.99467347 -0.63323197
H  -4.41587656 -0.844604 -1.4471871
C  -7.60756001 -1.67398919 -0.65804012
H  -8.7138549 -3.30445257 -1.5274115
H  -6.24177152 -0.16528072 0.05019751
H  -8.41119363 -1.37382372 0.00562516
C  -5.89228905 -1.35225897 -6.5946502
C  -6.12920333 -3.65436747 -5.79618593
C  -6.84952621 -2.11884512 -7.48848428
H  -4.90084293 -1.27273067 -7.04399269
H  -6.22791863 -0.36406108 -6.28737339
C  -6.39211158 -3.56344987 -7.29627885
H  -7.0260452 -3.93227482 -5.2439274
H  -5.3200302 -4.33347713 -5.5333284
H  -7.88343597 -1.98424195 -7.15642265
H  -6.77429542 -1.77893792 -8.52193809
H  -7.13704381 -4.29807119 -7.60359504
H  -5.4728693 -3.75182559 -7.85792742
N  -5.75225933 -2.23360855 -5.35943729
H  -6.45530245 -1.93016845 -4.67855444
