program: Gaussian 16
title: Title Card Required
version: ES64L-G16RevC.02
basis: 6-31+G(d,p)
method: UwB97XD TD-FC
operation: Force
keyword: #p
keyword: td=(nstates=30,root=2)
keyword: uwb97xd/6-31+g(d,p)
keyword: force
keyword: scrf=(CPCM,solvent=chloroform)
keyword: nosymm
keyword: scf=xqc
keyword: Guess=mix
keyword: density=current
title: #p td=(nstates=30,root=2) uwb97xd/6-31+g(d,p) force scrf=(CPCM,solvent
basis: NPDir=0 NMtPBC= 1 NCelOv= 1 NCel= 1 NClECP= 1 NCelD= 1
basis: NCelK= 1 NCelE2= 1 NClLst= 1 CellRange= 0.0.
basis: One-electron integrals computed using PRISM.
basis: NBasis= 859 RedAO= T EigKep= 1.05D-06 NBF= 859
basis: NBsUse= 853 1.00D-06 EigRej= 9.75D-07 NBFU= 853
converged: NO NO NO NO
hfenergy: -1479.2141779 hartree
pointgroup: C01 [X(C32H35N3O1)]
dipole: -4.9878802 -1.8253946 -4.2521571 debye
InChI: InChI=1/32C.3N.O.35H
charge 2 multiplicity 1
71 atoms
C  0.26250563 -1.94038426 -0.0057059
C  -0.92697838 -1.7852791 -0.77473955
C  -1.3826124 -0.46573535 -1.12624574
C  -0.61063489 0.62838253 -0.74488634
C  0.55721465 0.44381733 -0.0046705
C  1.02170821 -0.86241549 0.38586052
C  -0.5992237 -3.98851038 -0.37335452
C  -1.46354512 -3.07497928 -1.00853884
H  -2.31364111 -0.31500615 -1.66055716
H  -0.93509517 1.62976513 -1.0026006
H  1.13592398 1.30540265 0.307955
H  1.92557694 -0.97614616 0.9664123
N  0.4293039 -3.32625384 0.22823131
H  -0.69433291 -5.06143588 -0.33025579
C  1.54616774 -3.9129052 0.88147241
O  2.37812631 -3.18523541 1.3795181
C  1.68093241 -5.41463296 0.85844748
H  2.28329497 -5.66365097 1.73330441
H  0.72260313 -5.92906705 0.96254469
C  2.42904873 -5.89149891 -0.41550015
H  2.74790629 -6.9212188 -0.22695444
H  3.33496719 -5.2902978 -0.54114218
C  1.59416413 -5.85137173 -1.6642383
H  0.7990898 -6.59482775 -1.73238151
C  1.7613271 -4.98485511 -2.66465944
H  2.54556075 -4.2318869 -2.63662449
H  1.12477035 -5.00668358 -3.54390776
C  -2.68030674 -3.41078956 -1.68560918
H  -3.28530624 -4.25357204 -1.36884595
N  -3.09729113 -2.71144485 -2.74526061
H  -2.50492282 -1.97355818 -3.11058929
C  -2.61678503 -0.40731192 -4.99829742
C  -3.92355932 -0.69731198 -4.59075296
C  -4.71096919 0.32549582 -4.04965539
C  -4.19077 1.60709947 -3.90113679
C  -2.8769108 1.88080489 -4.2805742
C  -2.09129147 0.87339801 -4.83363259
H  -2.00435376 -1.18195984 -5.4532504
H  -5.73329276 0.13821426 -3.73702465
H  -4.81324824 2.39161663 -3.48461675
H  -2.472713 2.87960461 -4.15476129
H  -1.07450843 1.08194076 -5.14813437
C  -4.40397312 -2.12983546 -4.69856732
H  -3.72267942 -2.67672901 -5.35675238
C  -4.42005644 -2.87705847 -3.3252316
H  -4.55015645 -3.94659218 -3.5300969
C  -5.52409244 -2.44852536 -2.36756186
C  -6.73531734 -3.14632303 -2.35845998
C  -5.34919178 -1.38268189 -1.48074489
C  -7.77229284 -2.7525016 -1.51370328
H  -6.86496166 -4.02345539 -2.98644263
C  -6.38009748 -0.9918611 -0.63370959
H  -4.40446256 -0.85281736 -1.44491186
C  -7.59914275 -1.66922385 -0.6569159
H  -8.7052602 -3.30588026 -1.51494834
H  -6.22967719 -0.16045481 0.046474
H  -8.40314519 -1.3636288 0.00398674
C  -5.89266604 -1.35489121 -6.59467806
C  -6.1294341 -3.65641141 -5.79446358
C  -6.84937181 -2.12189287 -7.48812909
H  -4.90084764 -1.2757097 -7.04356701
H  -6.22801694 -0.36642397 -6.28794077
C  -6.39230422 -3.56649053 -7.29462311
H  -7.02654102 -3.93359252 -5.24221829
H  -5.32053119 -4.33569528 -5.53097209
H  -7.88329526 -1.98683569 -7.15674636
H  -6.77315714 -1.78250753 -8.52157353
H  -7.13753873 -4.30098623 -7.60140066
H  -5.47326791 -3.75578578 -7.85624824
N  -5.75225054 -2.23516758 -5.35929612
H  -6.45397033 -1.93162672 -4.67702843
