program: Gaussian 16
title: Title Card Required
version: ES64L-G16RevC.02
basis: 6-31+G(d,p)
method: UwB97XD TD-FC
operation: Force
keyword: #p
keyword: td=(nstates=30,root=2)
keyword: uwb97xd/6-31+g(d,p)
keyword: force
keyword: scrf=(CPCM,solvent=chloroform)
keyword: nosymm
keyword: scf=xqc
keyword: Guess=mix
keyword: density=current
title: #p td=(nstates=30,root=2) uwb97xd/6-31+g(d,p) force scrf=(CPCM,solvent
basis: NPDir=0 NMtPBC= 1 NCelOv= 1 NCel= 1 NClECP= 1 NCelD= 1
basis: NCelK= 1 NCelE2= 1 NClLst= 1 CellRange= 0.0.
basis: One-electron integrals computed using PRISM.
basis: NBasis= 859 RedAO= T EigKep= 1.05D-06 NBF= 859
basis: NBsUse= 853 1.00D-06 EigRej= 9.73D-07 NBFU= 853
converged: NO NO NO NO
hfenergy: -1479.2142372 hartree
pointgroup: C01 [X(C32H35N3O1)]
dipole: -3.2894313 -0.237212 -3.363308 debye
InChI: InChI=1/32C.3N.O.35H
charge 2 multiplicity 1
71 atoms
C  0.26175376 -1.9405171 -0.00433403
C  -0.9268425 -1.78572106 -0.77488558
C  -1.38427477 -0.46636236 -1.12452882
C  -0.61283803 0.62671276 -0.74105757
C  0.55578512 0.4434523 -0.00164319
C  1.02034896 -0.86244877 0.3879022
C  -0.59717135 -3.98881197 -0.37469611
C  -1.46152788 -3.07566059 -1.01031498
H  -2.31528387 -0.31480591 -1.65886737
H  -0.93783536 1.62807672 -0.99730056
H  1.13348555 1.30529942 0.31245651
H  1.92347821 -0.9760793 0.96947681
N  0.42952122 -3.32601368 0.22853358
H  -0.69267599 -5.06101234 -0.33174959
C  1.54663453 -3.9129756 0.88136228
O  2.37887819 -3.1854087 1.37938059
C  1.68120605 -5.41447873 0.85830229
H  2.28386488 -5.66318849 1.73331577
H  0.72334673 -5.92943403 0.9630793
C  2.4282367 -5.89138186 -0.41580213
H  2.7473705 -6.92096538 -0.22706718
H  3.33412123 -5.29045668 -0.54201871
C  1.59251787 -5.8518569 -1.66420666
H  0.7987757 -6.59703151 -1.7321743
C  1.75803281 -4.98472242 -2.66390892
H  2.5407949 -4.22982055 -2.63633249
H  1.12108758 -5.00702131 -3.54290203
C  -2.6774061 -3.41228096 -1.68790648
H  -3.28016809 -4.25778757 -1.37463684
N  -3.09536482 -2.71273317 -2.74690482
H  -2.50401981 -1.97415926 -3.1123759
C  -2.61720277 -0.40637881 -4.99956043
C  -3.92386993 -0.69678553 -4.59183696
C  -4.71141662 0.32567359 -4.05046088
C  -4.19150319 1.60737343 -3.90157695
C  -2.87786242 1.88152783 -4.28133073
C  -2.0921288 0.87436451 -4.83468589
H  -2.00470795 -1.18098646 -5.45434784
H  -5.73347687 0.13814472 -3.73700667
H  -4.81384672 2.39161692 -3.48439369
H  -2.47402058 2.88051681 -4.15627924
H  -1.07540811 1.08304509 -5.14924269
C  -4.40356965 -2.12953221 -4.69926989
H  -3.72279018 -2.67650419 -5.35794754
C  -4.41874278 -2.87652007 -3.32544556
H  -4.54929288 -3.94556531 -3.53032448
C  -5.52259321 -2.44765811 -2.36782319
C  -6.73361624 -3.14491767 -2.35777696
C  -5.34752906 -1.38040672 -1.48173799
C  -7.7702864 -2.75165867 -1.51230691
H  -6.86423243 -4.02275439 -2.98506934
C  -6.3778806 -0.99009353 -0.63424091
H  -4.40296598 -0.85074918 -1.44742268
C  -7.59616732 -1.66791674 -0.65539023
H  -8.70293269 -3.30480866 -1.51204176
H  -6.22691626 -0.15804236 0.04542316
H  -8.39980889 -1.36232671 0.00590079
C  -5.8933942 -1.3556602 -6.59571663
C  -6.12970834 -3.65658687 -5.79422213
C  -6.8498775 -2.12336484 -7.4888829
H  -4.90172169 -1.27638671 -7.04474044
H  -6.22893459 -0.36700403 -6.28972436
C  -6.39243409 -3.56779669 -7.29455661
H  -7.02673515 -3.93363563 -5.24173644
H  -5.32093437 -4.33566842 -5.53011399
H  -7.88374379 -1.98839255 -7.15714224
H  -6.77384896 -1.78467832 -8.52267798
H  -7.13759751 -4.30259933 -7.60093436
H  -5.47320873 -3.7571845 -7.8558222
N  -5.7523969 -2.23521183 -5.35971685
H  -6.45432765 -1.93116257 -4.67784249
