program: Gaussian 16
title: Title Card Required
version: ES64L-G16RevC.02
basis: 6-31+G(d,p)
method: UwB97XD TD-FC
operation: Force
keyword: #p
keyword: td=(nstates=30,root=2)
keyword: uwb97xd/6-31+g(d,p)
keyword: force
keyword: scrf=(CPCM,solvent=chloroform)
keyword: nosymm
keyword: scf=xqc
keyword: Guess=mix
keyword: density=current
title: #p td=(nstates=30,root=2) uwb97xd/6-31+g(d,p) force scrf=(CPCM,solvent
basis: NPDir=0 NMtPBC= 1 NCelOv= 1 NCel= 1 NClECP= 1 NCelD= 1
basis: NCelK= 1 NCelE2= 1 NClLst= 1 CellRange= 0.0.
basis: One-electron integrals computed using PRISM.
basis: NBasis= 859 RedAO= T EigKep= 1.05D-06 NBF= 859
basis: NBsUse= 853 1.00D-06 EigRej= 9.71D-07 NBFU= 853
converged: NO NO NO NO
hfenergy: -1479.2141443 hartree
pointgroup: C01 [X(C32H35N3O1)]
dipole: -3.2930687 -0.2323924 -3.3655377 debye
InChI: InChI=1/32C.3N.O.35H
charge 2 multiplicity 1
71 atoms
C  0.26121778 -1.94033709 -0.00311977
C  -0.9269856 -1.78662774 -0.77473067
C  -1.38584685 -0.46708309 -1.12246257
C  -0.61491925 0.62580972 -0.73716721
C  0.55403404 0.4429632 0.00129257
C  1.01906344 -0.86306714 0.3899674
C  -0.59550494 -3.98973491 -0.37579079
C  -1.45920162 -3.07627797 -1.01134868
H  -2.3165051 -0.31385963 -1.6564821
H  -0.9406091 1.62703838 -0.99171805
H  1.13070504 1.30474152 0.31643367
H  1.92073967 -0.9758767 0.97260579
N  0.43050051 -3.32721188 0.22900928
H  -0.69074036 -5.06113032 -0.33317558
C  1.54724399 -3.91267941 0.88114231
O  2.38014723 -3.18630748 1.37948223
C  1.68192311 -5.41437667 0.85814106
H  2.28440374 -5.6618958 1.7334386
H  0.72349935 -5.92901991 0.96328187
C  2.42694126 -5.8910883 -0.41606239
H  2.74625952 -6.92069846 -0.22688177
H  3.33340869 -5.29011525 -0.54299547
C  1.59076575 -5.85263221 -1.66390831
H  0.79882725 -6.59894617 -1.73206113
C  1.75470711 -4.98421714 -2.66359356
H  2.53586922 -4.22781137 -2.6359246
H  1.11714988 -5.00747022 -3.54193365
C  -2.67372255 -3.41358993 -1.69079948
H  -3.27398145 -4.2625473 -1.3802406
N  -3.09278464 -2.71399619 -2.74960857
H  -2.50261542 -1.97562922 -3.11488613
C  -2.61770201 -0.40560343 -5.00052305
C  -3.92402574 -0.69641001 -4.5927467
C  -4.71183559 0.32586976 -4.05088579
C  -4.19226455 1.60753925 -3.90189759
C  -2.87885546 1.88221915 -4.28224648
C  -2.09299221 0.8753554 -4.83566722
H  -2.00494786 -1.18005448 -5.4552049
H  -5.73362148 0.13804391 -3.73652346
H  -4.81439106 2.39154821 -3.4840534
H  -2.47544575 2.88144327 -4.15802441
H  -1.07633477 1.08415933 -5.15031758
C  -4.40337289 -2.12914603 -4.69989847
H  -3.72290422 -2.67628375 -5.35915287
C  -4.41730005 -2.87577388 -3.32569081
H  -4.54985459 -3.94468025 -3.53079601
C  -5.52079186 -2.44635137 -2.36758661
C  -6.7321645 -3.14372963 -2.35695749
C  -5.34592728 -1.37840554 -1.48326453
C  -7.76802723 -2.75042168 -1.51106911
H  -6.8633907 -4.0218252 -2.98371284
C  -6.37597132 -0.98810799 -0.63483269
H  -4.40178067 -0.84792675 -1.45039973
C  -7.59354567 -1.66660799 -0.65396628
H  -8.70099041 -3.30362015 -1.50921917
H  -6.22419216 -0.15573025 0.04435727
H  -8.39623951 -1.36131102 0.00834492
C  -5.8939599 -1.35629305 -6.59697046
C  -6.13000037 -3.65673879 -5.79396242
C  -6.85034366 -2.12504621 -7.48966298
H  -4.90270599 -1.27697064 -7.04612656
H  -6.22994249 -0.36769928 -6.29168575
C  -6.39261126 -3.56912557 -7.29451119
H  -7.02697226 -3.93353678 -5.24128086
H  -5.32124806 -4.33562259 -5.52922983
H  -7.8844276 -1.99002797 -7.15769365
H  -6.77472185 -1.78693705 -8.52381681
H  -7.13761418 -4.30429972 -7.60045304
H  -5.47315976 -3.7585708 -7.85538006
N  -5.75261216 -2.23524712 -5.36023968
H  -6.45460067 -1.93066857 -4.67878535
