program: Gaussian 16
title: Title Card Required
version: ES64L-G16RevC.02
basis: 6-31+G(d,p)
method: UwB97XD TD-FC
operation: Force
keyword: #p
keyword: td=(nstates=30,root=2)
keyword: uwb97xd/6-31+g(d,p)
keyword: force
keyword: scrf=(CPCM,solvent=chloroform)
keyword: nosymm
keyword: scf=xqc
keyword: Guess=mix
keyword: density=current
title: #p td=(nstates=30,root=2) uwb97xd/6-31+g(d,p) force scrf=(CPCM,solvent
basis: NPDir=0 NMtPBC= 1 NCelOv= 1 NCel= 1 NClECP= 1 NCelD= 1
basis: NCelK= 1 NCelE2= 1 NClLst= 1 CellRange= 0.0.
basis: One-electron integrals computed using PRISM.
basis: NBasis= 859 RedAO= T EigKep= 1.06D-06 NBF= 859
basis: NBsUse= 853 1.00D-06 EigRej= 9.70D-07 NBFU= 853
converged: NO NO NO NO
hfenergy: -1479.2142021 hartree
pointgroup: C01[X(C32H35N3O1)]
dipole: -4.9829718 -1.8284375 -4.2554424 debye
InChI: InChI=1/32C.3N.O.35H
charge 2 multiplicity 1
71 atoms
C  0.26117097 -1.94162724 -0.00274071
C  -0.92690683 -1.78700992 -0.77396057
C  -1.38616969 -0.46685374 -1.12092391
C  -0.61610763 0.62506844 -0.735233
C  0.55224913 0.44220596 0.00257382
C  1.0182587 -0.86344097 0.39091928
C  -0.5945824 -3.98992676 -0.37582624
C  -1.45841409 -3.0771334 -1.01151377
H  -2.31693144 -0.31237868 -1.65498003
H  -0.94251693 1.62756024 -0.98861508
H  1.12867438 1.30418243 0.31827244
H  1.91912244 -0.97575257 0.97462541
N  0.43105296 -3.32766911 0.22886092
H  -0.68966421 -5.06278977 -0.33406058
C  1.54828339 -3.91305711 0.88128099
O  2.38112792 -3.18759407 1.37974559
C  1.68177179 -5.41427049 0.8582244
H  2.28490829 -5.66020563 1.73365443
H  0.72353048 -5.92837846 0.96295999
C  2.42684451 -5.89091203 -0.41629108
H  2.74500834 -6.92042731 -0.22654157
H  3.33268187 -5.28966542 -0.54369745
C  1.59008478 -5.85263389 -1.66386854
H  0.79887583 -6.59997594 -1.73207346
C  1.75265416 -4.98402021 -2.66339773
H  2.5330805 -4.22683977 -2.63547493
H  1.11478388 -5.0078007 -3.54151786
C  -2.67149736 -3.41448653 -1.69287458
H  -3.26934861 -4.26483527 -1.38296472
N  -3.09095671 -2.71484036 -2.75124626
H  -2.50079224 -1.97577029 -3.11674595
C  -2.61790538 -0.40526193 -5.00093787
C  -3.92427915 -0.69617671 -4.59310182
C  -4.71204948 0.32588764 -4.05093607
C  -4.19262498 1.60761566 -3.90206662
C  -2.87948811 1.88260693 -4.28291324
C  -2.09337688 0.87586836 -4.83626162
H  -2.00497485 -1.17948471 -5.4556676
H  -5.73371688 0.13803234 -3.73616977
H  -4.81468917 2.39148332 -3.48380759
H  -2.4762712 2.88196014 -4.15902328
H  -1.07687757 1.0848366 -5.15086403
C  -4.40340354 -2.12900216 -4.70035579
H  -3.72309793 -2.67614491 -5.35961022
C  -4.41677356 -2.87560441 -3.32621792
H  -4.55098517 -3.94415692 -3.5310366
C  -5.51948793 -2.44568666 -2.36736869
C  -6.73122972 -3.1434187 -2.35653205
C  -5.34531555 -1.37745635 -1.48399666
C  -7.76722687 -2.74947489 -1.51015408
H  -6.86292767 -4.02114109 -2.98303738
C  -6.37469326 -0.98681185 -0.63538034
H  -4.40121179 -0.8460524 -1.45224587
C  -7.59234396 -1.66581352 -0.65362858
H  -8.69990554 -3.30286684 -1.50751827
H  -6.22267493 -0.15464475 0.04372967
H  -8.39423863 -1.360878 0.01010776
C  -5.89433199 -1.35677335 -6.59772671
C  -6.13013467 -3.65693341 -5.79378277
C  -6.85074197 -2.1259282 -7.49005296
H  -4.90301522 -1.277204 -7.04708111
H  -6.23059009 -0.36810454 -6.29284947
C  -6.39270946 -3.56988338 -7.29434798
H  -7.02716361 -3.93341585 -5.24105634
H  -5.3213269 -4.33557762 -5.52868996
H  -7.88474933 -1.99098925 -7.15819722
H  -6.77533221 -1.78822701 -8.52431871
H  -7.13761204 -4.30522195 -7.60024701
H  -5.47315307 -3.75934784 -7.8551293
N  -5.75270543 -2.23518924 -5.36062045
H  -6.45474055 -1.93040991 -4.67930467
