program: Gaussian 16
title: Title Card Required
version: ES64L-G16RevC.02
basis: 6-31+G(d,p)
method: UwB97XD TD-FC
operation: Force
keyword: #p
keyword: td=(nstates=30,root=2)
keyword: uwb97xd/6-31+g(d,p)
keyword: force
keyword: scrf=(CPCM,solvent=chloroform)
keyword: nosymm
keyword: scf=xqc
keyword: Guess=mix
keyword: density=current
title: #p td=(nstates=30,root=2) uwb97xd/6-31+g(d,p) force scrf=(CPCM,solvent
basis: NPDir=0 NMtPBC= 1 NCelOv= 1 NCel= 1 NClECP= 1 NCelD= 1
basis: NCelK= 1 NCelE2= 1 NClLst= 1 CellRange= 0.0.
basis: One-electron integrals computed using PRISM.
basis: NBasis= 859 RedAO= T EigKep= 1.06D-06 NBF= 859
basis: NBsUse= 853 1.00D-06 EigRej= 9.69D-07 NBFU= 853
converged: NO NO NO NO
hfenergy: -1479.2142114 hartree
pointgroup: C01 [X(C32H35N3O1)]
dipole: -4.9765105 -1.8302197 -4.2544129 debye
InChI: InChI=1/32C.3N.O.35H
charge 2 multiplicity 1
71 atoms
C  0.26142015 -1.94229605 -0.00239026
C  -0.92688636 -1.78723013 -0.77332033
C  -1.38669221 -0.46720028 -1.11972137
C  -0.61740173 0.62598703 -0.73395278
C  0.55128364 0.4416841 0.00409084
C  1.01758314 -0.86407149 0.39191762
C  -0.59403278 -3.99095348 -0.37582664
C  -1.45791556 -3.07779637 -1.01183114
H  -2.3171243 -0.3114239 -1.65343541
H  -0.94391584 1.6277324 -0.98591933
H  1.12709941 1.30366582 0.31960879
H  1.91796369 -0.97572401 0.97639032
N  0.43164694 -3.32780579 0.2288014
H  -0.68866471 -5.06389874 -0.33471694
C  1.54904993 -3.91350571 0.88141592
O  2.3820793 -3.18830564 1.37997788
C  1.68193744 -5.41395875 0.85840892
H  2.28523108 -5.65901166 1.73371645
H  0.72318353 -5.9276454 0.96281229
C  2.42666758 -5.89057198 -0.41655879
H  2.74406903 -6.92042764 -0.22628747
H  3.33210197 -5.28930757 -0.54425881
C  1.58953619 -5.85309645 -1.66339155
H  0.79901565 -6.60067526 -1.73215454
C  1.75103774 -4.98339778 -2.66368684
H  2.53066309 -4.22614746 -2.63511283
H  1.11281886 -5.00808943 -3.54116665
C  -2.66960108 -3.41551041 -1.69488551
H  -3.26553297 -4.26698242 -1.38523159
N  -3.08983828 -2.71562414 -2.75269579
H  -2.49897293 -1.97607093 -3.11858639
C  -2.61802766 -0.40491981 -5.00114247
C  -3.92453513 -0.69596953 -4.59328674
C  -4.71222041 0.3257576 -4.05085416
C  -4.19282307 1.60776948 -3.90216156
C  -2.88004463 1.88295767 -4.283505
C  -2.09379002 0.87612202 -4.83672017
H  -2.00495164 -1.17908483 -5.45595519
H  -5.73373047 0.13795634 -3.73571492
H  -4.8149607 2.39141723 -3.48357239
H  -2.4769966 2.88239764 -4.15988902
H  -1.0772404 1.08541573 -5.15134806
C  -4.40350624 -2.12882903 -4.70083792
H  -3.72325716 -2.67594569 -5.35993399
C  -4.41647188 -2.87583934 -3.32683337
H  -4.55229593 -3.94371811 -3.53131419
C  -5.51876984 -2.44542424 -2.36744622
C  -6.73037476 -3.14286795 -2.35589057
C  -5.34443545 -1.37629261 -1.48447262
C  -7.76633671 -2.74863769 -1.50945422
H  -6.86241382 -4.02063734 -2.98257613
C  -6.37363196 -0.98567766 -0.63570762
H  -4.40105064 -0.84430768 -1.45387813
C  -7.59146398 -1.66515008 -0.65333634
H  -8.69912829 -3.3022222 -1.50634681
H  -6.22152305 -0.15371148 0.0432076
H  -8.39256534 -1.36065958 0.01167997
C  -5.89465342 -1.35717547 -6.59839995
C  -6.13019575 -3.65707143 -5.7936549
C  -6.85107789 -2.12662799 -7.490355
H  -4.90323154 -1.2773766 -7.04796145
H  -6.23115169 -0.3684253 -6.29380244
C  -6.39276433 -3.57056064 -7.29420092
H  -7.02736927 -3.933258 -5.24086483
H  -5.32137651 -4.33557095 -5.5282894
H  -7.88503662 -1.99182338 -7.15867754
H  -6.77587152 -1.78933061 -8.52469023
H  -7.13753665 -4.30601159 -7.60002297
H  -5.47320861 -3.75997036 -7.85491017
N  -5.75278286 -2.23514287 -5.36101343
H  -6.45480719 -1.93016409 -4.67970601
