program: Gaussian 16
title: Title Card Required
version: ES64L-G16RevC.02
basis: 6-31+G(d,p)
method: UwB97XD TD-FC
operation: Force
keyword: #p
keyword: td=(nstates=30,root=2)
keyword: uwb97xd/6-31+g(d,p)
keyword: force
keyword: scrf=(CPCM,solvent=chloroform)
keyword: nosymm
keyword: scf=xqc
keyword: Guess=mix
keyword: density=current
title: #p td=(nstates=30,root=2) uwb97xd/6-31+g(d,p) force scrf=(CPCM,solvent
basis: NPDir=0 NMtPBC= 1 NCelOv= 1 NCel= 1 NClECP= 1 NCelD= 1
basis: NCelK= 1 NCelE2= 1 NClLst= 1 CellRange= 0.0.
basis: One-electron integrals computed using PRISM.
basis: NBasis= 859 RedAO= T EigKep= 1.07D-06 NBF= 859
basis: NBsUse= 853 1.00D-06 EigRej= 9.67D-07 NBFU= 853
converged: NO NO NO NO
hfenergy: -1479.2143188 hartree
pointgroup: C01 [X(C32H35N3O1)]
dipole: -3.294938 -0.2514312 -3.3754396 debye
InChI: InChI=1/32C.3N.O.35H
charge 2 multiplicity 1
71 atoms
C  0.25997 -1.94138 0.00184
C  -0.92572 -1.78845 -0.77376
C  -1.38856 -0.46835 -1.11197
C  -0.62143 0.62602 -0.72166
C  0.54917 0.44316 0.0155
C  1.01422 -0.86276 0.40145
C  -0.58837 -3.99136 -0.37975
C  -1.45243 -3.08076 -1.01958
H  -2.32176 -0.31873 -1.6424
H  -0.94952 1.62786 -0.97115
H  1.1275 1.30455 0.32918
H  1.91478 -0.97739 0.98623
N  0.4326 -3.3268 0.23056
H  -0.68214 -5.06329 -0.33581
C  1.55147 -3.91017 0.88201
O  2.38444 -3.18271 1.37813
C  1.68243 -5.41175 0.85913
H  2.28546 -5.66381 1.73306
H  0.72104 -5.91945 0.96706
C  2.4242 -5.89079 -0.4169
H  2.74375 -6.92014 -0.22751
H  3.33038 -5.29026 -0.54592
C  1.58625 -5.85412 -1.66398
H  0.79903 -6.60538 -1.73317
C  1.74191 -4.98273 -2.66228
H  2.51721 -4.22019 -2.63537
H  1.10214 -5.00921 -3.53901
C  -2.66115 -3.42564 -1.70641
H  -3.25129 -4.28485 -1.40384
N  -3.08819 -2.7226 -2.75976
H  -2.49431 -1.98977 -3.13206
C  -2.61895 -0.40368 -5.00141
C  -3.9251 -0.69527 -4.59367
C  -4.71269 0.32568 -4.04932
C  -4.19456 1.60816 -3.90177
C  -2.8828 1.88474 -4.28625
C  -2.09581 0.87811 -4.83845
H  -2.00538 -1.17803 -5.45527
H  -5.73252 0.1359 -3.73018
H  -4.81672 2.39109 -3.4820
H  -2.48152 2.88533 -4.16589
H  -1.07978 1.0878 -5.1545
C  -4.40373 -2.12798 -4.70332
H  -3.72296 -2.67346 -5.36353
C  -4.4169 -2.87582 -3.3299
H  -4.56033 -3.94349 -3.5355
C  -5.51511 -2.44022 -2.36826
C  -6.72605 -3.13856 -2.35307
C  -5.34072 -1.36827 -1.4887
C  -7.76063 -2.74502 -1.50556
H  -6.85708 -4.01727 -2.97847
C  -6.36795 -0.98007 -0.63553
H  -4.40036 -0.83047 -1.46413
C  -7.58386 -1.66274 -0.64795
H  -8.69424 -3.29709 -1.5050
H  -6.21664 -0.1457 0.04086
H  -8.38326 -1.36057 0.02011
C  -5.89669 -1.35867 -6.60241
C  -6.1308 -3.65718 -5.79323
C  -6.85301 -2.13115 -7.49262
H  -4.90607 -1.27865 -7.05319
H  -6.23405 -0.36992 -6.29884
C  -6.39313 -3.57404 -7.29379
H  -7.02808 -3.93164 -5.23986
H  -5.32242 -4.33586 -5.52717
H  -7.88722 -1.99696 -7.16083
H  -6.77853 -1.79609 -8.52782
H  -7.13648 -4.31187 -7.59741
H  -5.47328 -3.76341 -7.85406
N  -5.75307 -2.23457 -5.36351
H  -6.4544 -1.92811 -4.68229
