program: Gaussian 16
title: Title Card Required
version: ES64L-G16RevC.02
basis: 6-31+G(d,p)
method: UwB97XD TD-FC
operation: Force
keyword: #p
keyword: td=(nstates=30,root=2)
keyword: uwb97xd/6-31+g(d,p)
keyword: force
keyword: scrf=(CPCM,solvent=chloroform)
keyword: nosymm
keyword: scf=xqc
keyword: Guess=mix
keyword: density=current
title: #p td=(nstates=30,root=2) uwb97xd/6-31+g(d,p) force scrf=(CPCM,solvent
basis: NPDir=0 NMtPBC= 1 NCelOv= 1 NCel= 1 NClECP= 1 NCelD= 1
basis: NCelK= 1 NCelE2= 1 NClLst= 1 CellRange= 0.0.
basis: One-electron integrals computed using PRISM.
basis: NBasis= 859 RedAO= T EigKep= 1.06D-06 NBF= 859
basis: NBsUse= 853 1.00D-06 EigRej= 9.63D-07 NBFU= 853
converged: NO NO NO NO
hfenergy: -1479.2143275 hartree
pointgroup: C01 [X(C32H35N3O1)]
dipole: -3.2897973 -0.244195 -3.367745 debye
InChI: InChI=1/32C.3N.O.35H
charge 2 multiplicity 1
71 atoms
C  0.25899499 -1.9433103 0.00141082
C  -0.92852563 -1.79073453 -0.7717285
C  -1.39422303 -0.47227125 -1.11038933
C  -0.63302713 0.62375934 -0.71600245
C  0.5359433 0.44202242 0.02247436
C  1.00944002 -0.86289306 0.40138529
C  -0.58762817 -3.99468054 -0.38298183
C  -1.45308032 -3.08256688 -1.01904958
H  -2.32501948 -0.32024875 -1.64425991
H  -0.96627334 1.62486312 -0.96244705
H  1.1058883 1.30580594 0.34504643
H  1.91183228 -0.97358425 0.98304471
N  0.43451081 -3.32999744 0.22742761
H  -0.68176322 -5.06725159 -0.34099308
C  1.55041755 -3.91270037 0.88352145
O  2.3776525 -3.18551647 1.3896472
C  1.68737897 -5.4140661 0.85850565
H  2.29727724 -5.65922171 1.72878446
H  0.72880977 -5.92661754 0.97285155
C  2.42332145 -5.89596893 -0.41986171
H  2.73970083 -6.92590987 -0.22843744
H  3.33058898 -5.29810673 -0.55343372
C  1.58246558 -5.86003677 -1.66494934
H  0.79952069 -6.61572551 -1.73597056
C  1.73195396 -4.98267615 -2.65855335
H  2.50373139 -4.21665219 -2.62699364
H  1.09105179 -5.00635938 -3.53465965
C  -2.65896251 -3.42096357 -1.71113735
H  -3.24645879 -4.28545624 -1.42126524
N  -3.08375647 -2.70985521 -2.76138258
H  -2.50544563 -1.95414629 -3.11124794
C  -2.61891974 -0.39957209 -5.0132899
C  -3.92332834 -0.69518144 -4.60321288
C  -4.71331475 0.32357346 -4.05791188
C  -4.19698656 1.60572088 -3.90428973
C  -2.88484205 1.88512404 -4.28571247
C  -2.09803013 0.88289 -4.84598007
H  -2.00452794 -1.17077214 -5.47114757
H  -5.73411935 0.1319493 -3.74296249
H  -4.8204704 2.38587117 -3.48127985
H  -2.48315059 2.88427861 -4.15578676
H  -1.08323215 1.09645182 -5.16353319
C  -4.40026652 -2.12879999 -4.70796978
H  -3.7204451 -2.67688858 -5.36726128
C  -4.41059752 -2.87145162 -3.33208377
H  -4.54741156 -3.94058116 -3.5338457
C  -5.50995734 -2.43894131 -2.36997969
C  -6.71997478 -3.13842754 -2.34900205
C  -5.33238204 -1.36716439 -1.49106494
C  -7.75190285 -2.74275866 -1.4990245
H  -6.85283184 -4.01921516 -2.97149514
C  -6.35780796 -0.97495791 -0.63807805
H  -4.39009344 -0.83324839 -1.46640367
C  -7.57456896 -1.65551657 -0.64733597
H  -8.68411126 -3.2973618 -1.48990323
H  -6.20299964 -0.14006713 0.0371
H  -8.37306337 -1.34963755 0.01987197
C  -5.89728022 -1.36079252 -6.60179739
C  -6.13118915 -3.65926182 -5.79126075
C  -6.8523325 -2.13401835 -7.49231223
H  -4.90678716 -1.27828586 -7.0522874
H  -6.23662455 -0.37304972 -6.29751781
C  -6.39345068 -3.57708223 -7.29186551
H  -7.02909273 -3.93148592 -5.23765489
H  -5.32406482 -4.33902792 -5.52358214
H  -7.88686933 -1.99888913 -7.16227222
H  -6.77582222 -1.79940168 -8.5274243
H  -7.13780639 -4.31398833 -7.59526519
H  -5.4737855 -3.76794838 -7.85196989
N  -5.75141224 -2.23683075 -5.36351995
H  -6.45029301 -1.93045645 -4.67987304
