program: Gaussian 16
title: Title Card Required
version: ES64L-G16RevC.02
basis: 6-31+G(d,p)
method: UwB97XD TD-FC
operation: Force
keyword: #p
keyword: td=(nstates=30,root=3)
keyword: uwb97xd/6-31+g(d,p)
keyword: force
keyword: scrf=(CPCM,solvent=chloroform)
keyword: nosymm
keyword: scf=xqc
keyword: Guess=mix
keyword: density=current
title: #p td=(nstates=30,root=3) uwb97xd/6-31+g(d,p) force scrf=(CPCM,solvent
basis: NPDir=0 NMtPBC= 1 NCelOv= 1 NCel= 1 NClECP= 1 NCelD= 1
basis: NCelK= 1 NCelE2= 1 NClLst= 1 CellRange= 0.0.
basis: One-electron integrals computed using PRISM.
basis: NBasis= 859 RedAO= T EigKep= 1.06D-06 NBF= 859
basis: NBsUse= 853 1.00D-06 EigRej= 9.63D-07 NBFU= 853
converged: NO NO NO NO
hfenergy: -1479.2144697 hartree
pointgroup: C01 [X(C32H35N3O1)]
dipole: -4.9260809 -1.8385215 -4.2400396 debye
InChI: InChI=1/32C.3N.O.35H
charge 2 multiplicity 1
71 atoms
C  0.25796475 -1.94375122 0.00175774
C  -0.92820329 -1.79077144 -0.77217918
C  -1.39424393 -0.4724279 -1.11068915
C  -0.63447387 0.62387318 -0.715806
C  0.53482286 0.44235194 0.02383163
C  1.00806674 -0.8623162 0.40133794
C  -0.58716185 -3.99442565 -0.38388266
C  -1.45286847 -3.08294172 -1.02077702
H  -2.32557419 -0.32218906 -1.644379
H  -0.96734281 1.62497279 -0.96170219
H  1.10467139 1.3057291 0.34690913
H  1.91178316 -0.9731169 0.98166602
N  0.43324009 -3.32919405 0.22741572
H  -0.68128935 -5.06688303 -0.34085929
C  1.54980725 -3.91317951 0.88374979
O  2.37569603 -3.18494413 1.38996597
C  1.68719209 -5.41418761 0.85788883
H  2.29859998 -5.65939908 1.72820817
H  0.73005593 -5.92818538 0.97370566
C  2.42343685 -5.89678997 -0.42018868
H  2.74004858 -6.92672075 -0.22886706
H  3.3306754 -5.29943318 -0.55392108
C  1.58226367 -5.86072721 -1.66491417
H  0.79913799 -6.61654947 -1.7362282
C  1.73120215 -4.98272984 -2.65819582
H  2.50236538 -4.21626498 -2.62598297
H  1.09025595 -5.00621059 -3.53419123
C  -2.65908258 -3.42112097 -1.71142936
H  -3.24684324 -4.28548866 -1.42222648
N  -3.0841762 -2.70836079 -2.76011558
H  -2.50650345 -1.95031928 -3.10801817
C  -2.61873195 -0.398939 -5.01467817
C  -3.92341686 -0.69500115 -4.604276
C  -4.71336206 0.3232238 -4.05907213
C  -4.19700545 1.6056713 -3.90460253
C  -2.88519508 1.88517776 -4.2855071
C  -2.09812869 0.88314864 -4.84682645
H  -2.00449384 -1.17007229 -5.47288743
H  -5.73424598 0.13131254 -3.74461383
H  -4.82078456 2.38535471 -3.48118715
H  -2.48319705 2.88414053 -4.15459867
H  -1.08352503 1.09735671 -5.16436123
C  -4.39967617 -2.12888679 -4.70856162
H  -3.72040399 -2.67684408 -5.36780504
C  -4.41003223 -2.87117384 -3.332064
H  -4.54447337 -3.94002924 -3.53281085
C  -5.50968539 -2.43885824 -2.37054308
C  -6.71935662 -3.13840687 -2.34887496
C  -5.33176361 -1.3669276 -1.49096354
C  -7.75132005 -2.7428199 -1.49811508
H  -6.85227372 -4.01953685 -2.97082808
C  -6.35648937 -0.97448362 -0.63813543
H  -4.38891648 -0.83422182 -1.46634315
C  -7.5734902 -1.6551306 -0.64730503
H  -8.68295199 -3.29756128 -1.48852511
H  -6.20145595 -0.13945329 0.03662219
H  -8.37227074 -1.34822681 0.01946616
C  -5.89745034 -1.3611587 -6.60161498
C  -6.13125616 -3.65955212 -5.79101439
C  -6.85221338 -2.1340939 -7.49225771
H  -4.90669781 -1.27818123 -7.05199339
H  -6.2367773 -0.37322061 -6.29717822
C  -6.39346925 -3.57737148 -7.29180559
H  -7.02922509 -3.93163213 -5.23743584
H  -5.3243242 -4.33933064 -5.52346569
H  -7.88672511 -1.99899358 -7.16228524
H  -6.77552193 -1.79963597 -8.52744751
H  -7.13797872 -4.31408345 -7.59511661
H  -5.47378996 -3.76844987 -7.85164732
N  -5.75121735 -2.23704412 -5.36348493
H  -6.45005996 -1.93063339 -4.6795686
