program: Gaussian 16
title: Title Card Required
version: ES64L-G16RevC.02
basis: 6-31+G(d,p)
method: UwB97XD TD-FC
operation: Force
keyword: #p
keyword: td=(nstates=30,root=2)
keyword: uwb97xd/6-31+g(d,p)
keyword: force
keyword: scrf=(CPCM,solvent=chloroform)
keyword: nosymm
keyword: scf=xqc
keyword: Guess=mix
keyword: density=current
title: #p td=(nstates=30,root=2) uwb97xd/6-31+g(d,p) force scrf=(CPCM,solvent
basis: NPDir=0 NMtPBC= 1 NCelOv= 1 NCel= 1 NClECP= 1 NCelD= 1
basis: NCelK= 1 NCelE2= 1 NClLst= 1 CellRange= 0.0.
basis: One-electron integrals computed using PRISM.
basis: NBasis= 859 RedAO= T EigKep= 1.06D-06 NBF= 859
basis: NBsUse= 853 1.00D-06 EigRej= 9.64D-07 NBFU= 853
converged: NO NO NO NO
hfenergy: -1479.2144283 hartree
pointgroup: C01[X(C32H35N3O1)]
dipole: -4.9305127 -1.8430109 -4.2442719 debye
InChI: InChI=1/32C.3N.O.35H
charge 2 multiplicity 1
71 atoms
C  0.25723296 -1.94429082 0.00162113
C  -0.92805636 -1.7911134 -0.77233929
C  -1.39442191 -0.47230239 -1.11094538
C  -0.63507469 0.62421613 -0.71590643
C  0.53472524 0.44306694 0.0243364
C  1.00850563 -0.86218446 0.4019244
C  -0.58692414 -3.99437139 -0.38399195
C  -1.45269065 -3.08269832 -1.02128464
H  -2.32567431 -0.32288273 -1.64434309
H  -0.9675856 1.62497279 -0.96150134
H  1.10425956 1.3054271 0.34732785
H  1.91158499 -0.97297263 0.98109638
N  0.43267905 -3.32887736 0.22731446
H  -0.68109844 -5.06665011 -0.34077024
C  1.54888914 -3.91392359 0.88338627
O  2.37573233 -3.18411353 1.39038053
C  1.6872098 -5.41422616 0.85773563
H  2.29896147 -5.65955175 1.72802786
H  0.7303669 -5.92865001 0.97396376
C  2.42343931 -5.89707703 -0.42016986
H  2.74021622 -6.92699445 -0.22900516
H  3.33075385 -5.29977805 -0.55405768
C  1.58223825 -5.86075377 -1.66516462
H  0.79902393 -6.61673366 -1.7362873
C  1.73092919 -4.98295368 -2.65787051
H  2.5020359 -4.21611795 -2.62571481
H  1.09004695 -5.00617367 -3.53411647
C  -2.65909494 -3.42114863 -1.71196687
H  -3.24712245 -4.28562897 -1.42237403
N  -3.08441787 -2.70811117 -2.75942926
H  -2.50674825 -1.94931739 -3.1070388
C  -2.6187584 -0.39871468 -5.0150138
C  -3.92332288 -0.69496375 -4.60462748
C  -4.71344064 0.32315616 -4.05936474
C  -4.19707298 1.60569258 -3.90465141
C  -2.88518343 1.88515743 -4.28548732
C  -2.09823465 0.88320686 -4.84701962
H  -2.00445976 -1.16991941 -5.47337154
H  -5.73425141 0.13112028 -3.74507376
H  -4.82085511 2.38519094 -3.48117455
H  -2.48321761 2.88410758 -4.15427721
H  -1.08353909 1.09761874 -5.16459849
C  -4.39961637 -2.12891421 -4.70867903
H  -3.72038048 -2.67679873 -5.36796999
C  -4.4099364 -2.87086608 -3.33206871
H  -4.54354101 -3.94006238 -3.53249125
C  -5.50969116 -2.4389097 -2.37079521
C  -6.71940293 -3.1382527 -2.34862909
C  -5.33126756 -1.36684404 -1.49107038
C  -7.7507809 -2.74276038 -1.49796076
H  -6.85209673 -4.01970998 -2.97071323
C  -6.35618612 -0.9741408 -0.63787549
H  -4.38869177 -0.83453683 -1.46628706
C  -7.57332294 -1.65516497 -0.64732517
H  -8.68276965 -3.29770853 -1.48819039
H  -6.20105633 -0.13935345 0.03641314
H  -8.37203444 -1.34783798 0.01931168
C  -5.89745574 -1.36120033 -6.60158383
C  -6.13129034 -3.65962368 -5.79095409
C  -6.85215215 -2.13414384 -7.49223847
H  -4.90668948 -1.27815277 -7.05190302
H  -6.23680426 -0.37329322 -6.29707699
C  -6.39347297 -3.57742953 -7.29177581
H  -7.02926439 -3.93167411 -5.23737769
H  -5.32437887 -4.33943795 -5.52345563
H  -7.88669427 -1.99901747 -7.16228708
H  -6.77544694 -1.79969374 -8.52744209
H  -7.13801923 -4.31410578 -7.59507999
H  -5.47379669 -3.76858797 -7.8515597
N  -5.7511901 -2.23711196 -5.36347364
H  -6.44998487 -1.93067547 -4.67946804
