program: Gaussian 16
title: Title Card Required
version: ES64L-G16RevC.02
basis: 6-31+G(d,p)
method: UwB97XD TD-FC
operation: Force
keyword: #p
keyword: td=(nstates=30,root=2)
keyword: uwb97xd/6-31+g(d,p)
keyword: force
keyword: scrf=(CPCM,solvent=chloroform)
keyword: nosymm
keyword: scf=xqc
keyword: Guess=mix
keyword: density=current
title: #p td=(nstates=30,root=2) uwb97xd/6-31+g(d,p) force scrf=(CPCM,solvent
basis: NPDir=0 NMtPBC= 1 NCelOv= 1 NCel= 1 NClECP= 1 NCelD= 1
basis: NCelK= 1 NCelE2= 1 NClLst= 1 CellRange= 0.0.
basis: One-electron integrals computed using PRISM.
basis: NBasis= 859 RedAO= T EigKep= 1.05D-06 NBF= 859
basis: NBsUse= 853 1.00D-06 EigRej= 9.62D-07 NBFU= 853
converged: NO NO NO NO
hfenergy: -1479.2143779 hartree
pointgroup: C01 [X(C32H35N3O1)]
dipole: -4.9503459 -1.838994 -4.257195 debye
InChI: InChI=1/32C.3N.O.35H
charge 2 multiplicity 1
71 atoms
C  0.25797719 -1.94234912 0.00250076
C  -0.92868018 -1.79160646 -0.77279164
C  -1.39462581 -0.47289039 -1.1110362
C  -0.63395162 0.62342724 -0.71503985
C  0.53255603 0.44282521 0.02413923
C  1.00668085 -0.86322982 0.40072353
C  -0.58754674 -3.99404061 -0.38506385
C  -1.45183087 -3.08338348 -1.0220149
H  -2.32552116 -0.3236431 -1.6442239
H  -0.96794822 1.62525234 -0.96120257
H  1.10440359 1.30600346 0.34824725
H  1.91154692 -0.97266807 0.98064241
N  0.43287047 -3.32971553 0.22795432
H  -0.68080121 -5.06543249 -0.34068812
C  1.54848697 -3.91300354 0.88354369
O  2.37468981 -3.18449273 1.39021213
C  1.68809847 -5.41450366 0.85804986
H  2.29887393 -5.65944909 1.72719849
H  0.73079997 -5.92922875 0.97427891
C  2.42317287 -5.8973635 -0.42038827
H  2.74039083 -6.92716608 -0.2291576
H  3.3307696 -5.30033452 -0.55413666
C  1.58198575 -5.86106352 -1.66514158
H  0.79903887 -6.6169318 -1.73635716
C  1.73079505 -4.98307556 -2.65772128
H  2.50150819 -4.21595461 -2.62537366
H  1.08977067 -5.006098 -3.53387414
C  -2.65946352 -3.41997201 -1.711947
H  -3.24756854 -4.28627619 -1.42269637
N  -3.0834164 -2.70805344 -2.75818707
H  -2.50743994 -1.94785193 -3.10620074
C  -2.61892354 -0.39906712 -5.01558708
C  -3.92324302 -0.6949259 -4.6051728
C  -4.71330706 0.32347368 -4.05971017
C  -4.19720909 1.60525563 -3.90477856
C  -2.88509813 1.88517081 -4.2855684
C  -2.09812512 0.88372399 -4.84719872
H  -2.0045312 -1.16951683 -5.47391983
H  -5.73436907 0.13084505 -3.74566459
H  -4.82100764 2.38506656 -3.48111926
H  -2.48324947 2.88402862 -4.15383058
H  -1.08379272 1.09792229 -5.16485454
C  -4.39953244 -2.12879209 -4.70853487
H  -3.72027965 -2.67692195 -5.36836107
C  -4.40918616 -2.87052421 -3.33203015
H  -4.54267631 -3.93991385 -3.53220703
C  -5.50944771 -2.43820825 -2.37051646
C  -6.71887407 -3.13858598 -2.34919577
C  -5.33178789 -1.36733644 -1.49132768
C  -7.75113004 -2.74320574 -1.49752883
H  -6.85193888 -4.01958798 -2.97024656
C  -6.35604395 -0.97492892 -0.63851098
H  -4.38798807 -0.83482354 -1.46629854
C  -7.57252287 -1.65423877 -0.64690669
H  -8.68239213 -3.29773947 -1.48766919
H  -6.20040505 -0.13862708 0.03666057
H  -8.37167249 -1.34739182 0.01905582
C  -5.89734911 -1.36106633 -6.60148641
C  -6.13143346 -3.6596364 -5.79106021
C  -6.85220511 -2.13426144 -7.492354
H  -4.90683375 -1.27814234 -7.05171076
H  -6.23683158 -0.37341435 -6.29701635
C  -6.3935355 -3.57746385 -7.29172531
H  -7.02930337 -3.93174412 -5.23725676
H  -5.32442612 -4.33953258 -5.52335319
H  -7.88672115 -1.99904111 -7.16220443
H  -6.77529754 -1.7997674 -8.52754894
H  -7.13815916 -4.31419315 -7.59502359
H  -5.47364876 -3.76879504 -7.8514859
N  -5.75119022 -2.23732844 -5.36328664
H  -6.44978321 -1.93076441 -4.67954357
