program: Gaussian 16
title: Title Card Required
version: ES64L-G16RevC.02
basis: 6-31+G(d,p)
method: UwB97XD TD-FC
operation: Force
keyword: #p
keyword: td=(nstates=30,root=2)
keyword: uwb97xd/6-31+g(d,p)
keyword: force
keyword: scrf=(CPCM,solvent=chloroform)
keyword: nosymm
keyword: scf=xqc
keyword: Guess=mix
keyword: density=current
title: #p td=(nstates=30,root=2) uwb97xd/6-31+g(d,p) force scrf=(CPCM,solvent
basis: NPDir=0 NMtPBC= 1 NCelOv= 1 NCel= 1 NClECP= 1 NCelD= 1
basis: NCelK= 1 NCelE2= 1 NClLst= 1 CellRange= 0.0.
basis: One-electron integrals computed using PRISM.
basis: NBasis= 859 RedAO= T EigKep= 1.06D-06 NBF= 859
basis: NBsUse= 853 1.00D-06 EigRej= 9.67D-07 NBFU= 853
converged: NO NO NO NO
hfenergy: -1479.2145343 hartree
pointgroup: C01 [X(C32H35N3O1)]
dipole: -4.9103565 -1.8440198 -4.229483 debye
InChI: InChI=1/32C.3N.O.35H
charge 2 multiplicity 1
71 atoms
C  0.25639913 -1.94314872 0.00193847
C  -0.92806834 -1.79041803 -0.773849
C  -1.39403035 -0.4719032 -1.11193539
C  -0.63631001 0.625608 -0.71535159
C  0.53318069 0.44311261 0.02588596
C  1.0078677 -0.86128007 0.4038882
C  -0.58746823 -3.99362173 -0.38547173
C  -1.4529631 -3.08268289 -1.02420202
H  -2.32652085 -0.32706712 -1.6441369
H  -0.96937316 1.62678611 -0.96141595
H  1.10337995 1.30482957 0.34932158
H  1.91325374 -0.97298818 0.97969533
N  0.43112715 -3.32816891 0.2278708
H  -0.67982133 -5.06610608 -0.33996042
C  1.54806455 -3.91229378 0.884025
O  2.37158911 -3.18307697 1.38934984
C  1.68728375 -5.41506322 0.85776505
H  2.30055033 -5.66075909 1.72700366
H  0.73119823 -5.93109698 0.97518058
C  2.42388487 -5.89852762 -0.42054145
H  2.74130246 -6.92872133 -0.22967926
H  3.33117147 -5.30118122 -0.55460767
C  1.58217613 -5.86225178 -1.66485744
H  0.7985347 -6.61705124 -1.73658598
C  1.72984327 -4.98242832 -2.65777619
H  2.5004418 -4.21583021 -2.62454571
H  1.08940243 -5.00612646 -3.53392559
C  -2.65881924 -3.42413401 -1.7147166
H  -3.24865226 -4.28599877 -1.42222498
N  -3.08695555 -2.70451629 -2.75801537
H  -2.50795879 -1.94657062 -3.10162936
C  -2.61869262 -0.39815656 -5.01662168
C  -3.9232257 -0.69477547 -4.60602952
C  -4.71353872 0.32304225 -4.06069685
C  -4.19732213 1.60552463 -3.90493734
C  -2.88518768 1.88512795 -4.28520683
C  -2.09822429 0.8837334 -4.84789459
H  -2.00437123 -1.16920517 -5.47529045
H  -5.73432709 0.13009963 -3.74699178
H  -4.82128801 2.38466229 -3.48104076
H  -2.4833011 2.88397118 -4.15299831
H  -1.08349807 1.09871574 -5.16558631
C  -4.39982912 -2.12873047 -4.70946327
H  -3.72029043 -2.67629212 -5.36843972
C  -4.41039309 -2.8702293 -3.3325656
H  -4.53844161 -3.94058185 -3.53068519
C  -5.51023806 -2.43819714 -2.37163728
C  -6.71937378 -3.13844322 -2.34823329
C  -5.33015059 -1.3670142 -1.49122326
C  -7.74945776 -2.74259616 -1.4967796
H  -6.85113205 -4.02021266 -2.97009793
C  -6.354346 -0.97360385 -0.63746511
H  -4.38699144 -0.83538876 -1.46579755
C  -7.57201374 -1.65480085 -0.64706428
H  -8.68131011 -3.29821733 -1.48726028
H  -6.19949756 -0.13827745 0.03592941
H  -8.37116295 -1.34640323 0.0183338
C  -5.89737243 -1.36136491 -6.60146651
C  -6.13139441 -3.65994646 -5.7906652
C  -6.85184617 -2.13436796 -7.49206594
H  -4.90645313 -1.27797782 -7.05161816
H  -6.23686519 -0.37368955 -6.29652058
C  -6.39347401 -3.57764761 -7.29139136
H  -7.0294826 -3.93183722 -5.23717046
H  -5.32451804 -4.3401137 -5.52360998
H  -7.88635479 -1.99913701 -7.16243872
H  -6.77522743 -1.79993148 -8.52714738
H  -7.13803171 -4.31409182 -7.59496134
H  -5.47396256 -3.76917399 -7.85120039
N  -5.75138782 -2.23724227 -5.36352566
H  -6.44956508 -1.93082293 -4.67880061
