program: Gaussian 16
title: Title Card Required
version: ES64L-G16RevC.02
basis: 6-31+G(d,p)
method: UwB97XD TD-FC
operation: Force
keyword: #p
keyword: td=(nstates=30,root=3)
keyword: uwb97xd/6-31+g(d,p)
keyword: force
keyword: scrf=(CPCM,solvent=chloroform)
keyword: nosymm
keyword: scf=xqc
keyword: Guess=mix
keyword: density=current
title: #p td=(nstates=30,root=3) uwb97xd/6-31+g(d,p) force scrf=(CPCM,solvent
basis: NPDir=0 NMtPBC= 1 NCelOv= 1 NCel= 1 NClECP= 1 NCelD= 1
basis: NCelK= 1 NCelE2= 1 NClLst= 1 CellRange= 0.0.
basis: One-electron integrals computed using PRISM.
basis: NBasis= 859 RedAO= T EigKep= 1.06D-06 NBF= 859
basis: NBsUse= 853 1.00D-06 EigRej= 9.63D-07 NBFU= 853
converged: NO NO NO NO
hfenergy: -1479.2141671 hartree
pointgroup: C01 [X(C32H35N3O1)]
dipole: -3.2976064 -0.2420617 -3.3751385 debye
InChI: InChI=1/32C.3N.O.35H
charge 2 multiplicity 1
71 atoms
C  0.26183881 -1.94261449 0.00085445
C  -0.92775066 -1.78955142 -0.77080125
C  -1.39162735 -0.47001761 -1.10981395
C  -0.62675791 0.62428174 -0.7188848
C  0.54354501 0.44144296 0.01854216
C  1.01457415 -0.86392562 0.40200945
C  -0.58847029 -3.99274861 -0.37965106
C  -1.45414103 -3.0809489 -1.01700805
H  -2.32251775 -0.31652817 -1.64270472
H  -0.95862103 1.62564159 -0.9669504
H  1.1157526 1.3048386 0.33514004
H  1.91427157 -0.97630912 0.98834615
N  0.4356019 -3.32878225 0.22793063
H  -0.6824864 -5.06485497 -0.33945986
C  1.55248372 -3.91140676 0.8829863
O  2.38378281 -3.18469629 1.38436949
C  1.68529043 -5.41251531 0.85982131
H  2.29079529 -5.66174701 1.73212429
H  0.72366468 -5.92013572 0.96933339
C  2.42375418 -5.89266278 -0.41793909
H  2.74069942 -6.92259059 -0.22728481
H  3.33000167 -5.29259223 -0.54987137
C  1.58447948 -5.85613943 -1.66456882
H  0.8002082 -6.61044245 -1.7345795
C  1.73655203 -4.98253822 -2.66049024
H  2.51093431 -4.21876649 -2.63229279
H  1.09645205 -5.0075586 -3.53748243
C  -2.65947176 -3.42435302 -1.71020646
H  -3.24811006 -4.28639399 -1.41341725
N  -3.08543135 -2.71831247 -2.76320763
H  -2.49896367 -1.97520732 -3.12632436
C  -2.61915523 -0.40210518 -5.00618183
C  -3.92447514 -0.69528094 -4.59765038
C  -4.71297279 0.32485627 -4.05241687
C  -4.19567169 1.60695571 -3.9025844
C  -2.88368652 1.88493153 -4.28621811
C  -2.0968108 0.88020373 -4.84158053
H  -2.00480554 -1.17486521 -5.46165235
H  -5.73316731 0.13445271 -3.73459909
H  -4.81870001 2.38873129 -3.48176408
H  -2.48270133 2.88512388 -4.16214405
H  -1.08138055 1.091589 -5.15876278
C  -4.40280237 -2.12825198 -4.70549117
H  -3.72177586 -2.67535585 -5.3642524
C  -4.41468432 -2.87423934 -3.33179369
H  -4.55765927 -3.94267 -3.53663713
C  -5.51247784 -2.43932492 -2.36898709
C  -6.72322479 -3.13833469 -2.35091628
C  -5.33669437 -1.36730638 -1.49007105
C  -7.75661007 -2.7435819 -1.50266035
H  -6.85529664 -4.01777972 -2.97508448
C  -6.36326498 -0.97751539 -0.6367173
H  -4.39619623 -0.82951414 -1.465883
C  -7.57951746 -1.65902334 -0.64759837
H  -8.68978585 -3.29661468 -1.49866696
H  -6.21125128 -0.14276562 0.03949295
H  -8.37821974 -1.35667958 0.02086471
C  -5.89694073 -1.35961077 -6.60254772
C  -6.13080446 -3.65809199 -5.79232224
C  -6.85286619 -2.13280982 -7.49247539
H  -4.90656427 -1.27861806 -7.05358941
H  -6.2354905 -0.37151626 -6.29874711
C  -6.39320256 -3.57555269 -7.29275002
H  -7.02850747 -3.93106555 -5.23884283
H  -5.32298461 -4.3373406 -5.52520738
H  -7.88730947 -1.99813982 -7.16184054
H  -6.77748094 -1.79796168 -8.52752755
H  -7.13682078 -4.31316921 -7.59615311
H  -5.47366312 -3.7653405 -7.85344305
N  -5.75239391 -2.23547352 -5.36380743
H  -6.45214604 -1.9290798 -4.68113906
