program: Gaussian 16
title: Title Card Required
version: ES64L-G16RevC.02
basis: 6-31+G(d,p)
method: UwB97XD TD-FC
operation: Force
keyword: #p
keyword: td=(nstates=30,root=3)
keyword: uwb97xd/6-31+g(d,p)
keyword: force
keyword: scrf=(CPCM,solvent=chloroform)
keyword: nosymm
keyword: scf=xqc
keyword: Guess=mix
keyword: density=current
title: #p td=(nstates=30,root=3) uwb97xd/6-31+g(d,p) force scrf=(CPCM,solvent
basis: NPDir=0 NMtPBC= 1 NCelOv= 1 NCel= 1 NClECP= 1 NCelD= 1
basis: NCelK= 1 NCelE2= 1 NClLst= 1 CellRange= 0.0.
basis: One-electron integrals computed using PRISM.
basis: NBasis= 859 RedAO= T EigKep= 1.06D-06 NBF= 859
basis: NBsUse= 853 1.00D-06 EigRej= 9.61D-07 NBFU= 853
converged: NO NO NO NO
hfenergy: -1479.2143549 hartree
pointgroup: C01 [X(C32H35N3O1)]
dipole: -4.9551098 -1.8330758 -4.2606134 debye
InChI: InChI=1/32C.3N.O.35H
charge 2 multiplicity 1
71 atoms
C  0.26154931 -1.94304975 0.00065779
C  -0.9281938 -1.78942488 -0.77064213
C  -1.39233038 -0.4708872 -1.10961011
C  -0.62867847 0.62441336 -0.71822023
C  0.54180985 0.44097912 0.019326
C  1.01371072 -0.86361668 0.40193962
C  -0.58847718 -3.99317136 -0.38018065
C  -1.4542717 -3.08168525 -1.01649166
H  -2.32319733 -0.31644028 -1.64326485
H  -0.96092132 1.62513039 -0.96573228
H  1.11260508 1.30520412 0.33752978
H  1.91367075 -0.97570364 0.98760013
N  0.43610565 -3.32941 0.22758256
H  -0.68259725 -5.06649551 -0.3402113
C  1.55241475 -3.91182475 0.88318754
O  2.38280591 -3.18538769 1.38617137
C  1.68594338 -5.41285539 0.85970694
H  2.29254003 -5.66072545 1.73146314
H  0.72473753 -5.92140984 0.97007307
C  2.42369749 -5.89333148 -0.41851461
H  2.74000245 -6.92337952 -0.22739768
H  3.3300683 -5.29373395 -0.55095504
C  1.58395416 -5.85722442 -1.66449344
H  0.80019621 -6.61195246 -1.73497038
C  1.73526272 -4.98230462 -2.6601852
H  2.50905849 -4.21831831 -2.63097979
H  1.09490666 -5.00718667 -3.5367773
C  -2.65914668 -3.42301084 -1.71089448
H  -3.2471484 -4.28600235 -1.41577768
N  -3.08497263 -2.71667501 -2.76318972
H  -2.50029184 -1.9694593 -3.12304892
C  -2.61911425 -0.40138836 -5.00790242
C  -3.9241244 -0.69531657 -4.59897498
C  -4.7131202 0.32438945 -4.05371922
C  -4.19602023 1.60670789 -3.90300486
C  -2.88402829 1.88498351 -4.28610519
C  -2.09718954 0.88085641 -4.84273649
H  -2.00467235 -1.17382708 -5.46407492
H  -5.73340667 0.13395367 -3.7366059
H  -4.81918798 2.38797313 -3.48165278
H  -2.48286266 2.88492566 -4.16056784
H  -1.08185042 1.09284227 -5.16004286
C  -4.40227273 -2.12844072 -4.70620328
H  -3.72136086 -2.67592502 -5.36484818
C  -4.41366499 -2.87356978 -3.3320815
H  -4.55582497 -3.94217593 -3.53630694
C  -5.51203759 -2.43970777 -2.36930457
C  -6.72219192 -3.13808668 -2.35006639
C  -5.33509954 -1.36695803 -1.49025524
C  -7.75528981 -2.74326491 -1.5019076
H  -6.85474284 -4.01821699 -2.97425793
C  -6.36206958 -0.97677427 -0.63710385
H  -4.39485834 -0.83022211 -1.46614738
C  -7.57825536 -1.65791215 -0.64759436
H  -8.68831971 -3.29670215 -1.4963154
H  -6.2092211 -0.1421924 0.03886124
H  -8.37682936 -1.35501709 0.02084245
C  -5.89706018 -1.35996422 -6.60239622
C  -6.13084209 -3.65838958 -5.79201171
C  -6.85275334 -2.13316236 -7.49240186
H  -4.90659948 -1.27855108 -7.05338881
H  -6.2358529 -0.37194647 -6.29850515
C  -6.39325987 -3.5759851 -7.29244979
H  -7.02864753 -3.93108855 -5.23854936
H  -5.32322952 -4.33778227 -5.52467324
H  -7.88719237 -1.99838009 -7.16205756
H  -6.77707511 -1.79838103 -8.52741402
H  -7.13702838 -4.31340474 -7.59589638
H  -5.4737663 -3.76598053 -7.85310627
N  -5.75209765 -2.23578839 -5.36383723
H  -6.45162206 -1.92945991 -4.6807666
