program: Gaussian 16
title: Title Card Required
version: ES64L-G16RevC.02
basis: 6-31+G(d,p)
method: UwB97XD TD-FC
operation: Force
keyword: #p
keyword: td=(nstates=30,root=2)
keyword: uwb97xd/6-31+g(d,p)
keyword: force
keyword: scrf=(CPCM,solvent=chloroform)
keyword: nosymm
keyword: scf=xqc
keyword: Guess=mix
keyword: density=current
title: #p td=(nstates=30,root=2) uwb97xd/6-31+g(d,p) force scrf=(CPCM,solvent
basis: NPDir=0 NMtPBC= 1 NCelOv= 1 NCel= 1 NClECP= 1 NCelD= 1
basis: NCelK= 1 NCelE2= 1 NClLst= 1 CellRange= 0.0.
basis: One-electron integrals computed using PRISM.
basis: NBasis= 859 RedAO= T EigKep= 1.06D-06 NBF= 859
basis: NBsUse= 853 1.00D-06 EigRej= 9.67D-07 NBFU= 853
converged: NO NO NO NO
hfenergy: -1479.2146769 hartree
pointgroup: C01 [X(C32H35N3O1)]
dipole: -3.2923853 -0.2622745 -3.3681339 debye
InChI: InChI=1/32C.3N.O.35H
charge 2 multiplicity 1
71 atoms
C  0.25719 -1.94145 0.00233
C  -0.92857 -1.78925 -0.77468
C  -1.39376 -0.47203 -1.11214
C  -0.63578 0.62579 -0.71463
C  0.53245 0.44213 0.02568
C  1.0067 -0.86118 0.40399
C  -0.5880 -3.99373 -0.38587
C  -1.45299 -3.08288 -1.02427
H  -2.32686 -0.32806 -1.64414
H  -0.97005 1.62783 -0.96173
H  1.10348 1.30509 0.34978
H  1.91456 -0.97321 0.97995
N  0.43115 -3.32869 0.2282
H  -0.67948 -5.06637 -0.33971
C  1.54651 -3.91255 0.88323
O  2.37188 -3.1818 1.38979
C  1.68785 -5.41542 0.85824
H  2.30073 -5.66106 1.7266
H  0.73091 -5.93168 0.9754
C  2.42388 -5.89889 -0.42049
H  2.74156 -6.92919 -0.22978
H  3.33145 -5.30125 -0.55476
C  1.58226 -5.86229 -1.66533
H  0.79843 -6.61702 -1.73661
C  1.72949 -4.98263 -2.65732
H  2.50028 -4.21572 -2.62436
H  1.08927 -5.00614 -3.53406
C  -2.65851 -3.42464 -1.71636
H  -3.24919 -4.28629 -1.42185
N  -3.08806 -2.70369 -2.7578
H  -2.50811 -1.94654 -3.10026
C  -2.61877 -0.39842 -5.01696
C  -3.92302 -0.69479 -4.60628
C  -4.71345 0.32328 -4.06091
C  -4.19752 1.60522 -3.90503
C  -2.88508 1.8851 -4.28513
C  -2.09807 0.88421 -4.84801
H  -2.0044 -1.16903 -5.47556
H  -5.73441 0.12988 -3.74728
H  -4.8214 2.38465 -3.48098
H  -2.48331 2.88393 -4.15282
H  -1.08347 1.09887 -5.16575
C  -4.40022 -2.12865 -4.70948
H  -3.72013 -2.6762 -5.36857
C  -4.41077 -2.86972 -3.33295
H  -4.53729 -3.94118 -3.53033
C  -5.51059 -2.43774 -2.37144
C  -6.71912 -3.13879 -2.34843
C  -5.33024 -1.36734 -1.49128
C  -7.74969 -2.74282 -1.49665
H  -6.85093 -4.02019 -2.96993
C  -6.35431 -0.97423 -0.63788
H  -4.38637 -0.8353 -1.46564
C  -7.57127 -1.65408 -0.6466
H  -8.68074 -3.2982 -1.48722
H  -6.19924 -0.13775 0.03611
H  -8.37104 -1.34627 0.01805
C  -5.89719 -1.3612 -6.6015
C  -6.13143 -3.65993 -5.79065
C  -6.85173 -2.13453 -7.49203
H  -4.90646 -1.27795 -7.05157
H  -6.23684 -0.37389 -6.29641
C  -6.39349 -3.57763 -7.29117
H  -7.02954 -3.93186 -5.23715
H  -5.32446 -4.34035 -5.52367
H  -7.88627 -1.99916 -7.16252
H  -6.77523 -1.79996 -8.52698
H  -7.13799 -4.31407 -7.59497
H  -5.47404 -3.76927 -7.85116
N  -5.75157 -2.23723 -5.36351
H  -6.44941 -1.93087 -4.67863
