program: Gaussian 16
title: Title Card Required
version: ES64L-G16RevC.02
basis: 6-31+G(d,p)
method: UwB97XD TD-FC
operation: Force
keyword: #p
keyword: td=(nstates=30,root=2)
keyword: uwb97xd/6-31+g(d,p)
keyword: force
keyword: scrf=(CPCM,solvent=chloroform)
keyword: nosymm
keyword: scf=xqc
keyword: Guess=mix
keyword: density=current
title: #p td=(nstates=30,root=2) uwb97xd/6-31+g(d,p) force scrf=(CPCM,solvent
basis: NPDir=0 NMtPBC= 1 NCelOv= 1 NCel= 1 NClECP= 1 NCelD= 1
basis: NCelK= 1 NCelE2= 1 NClLst= 1 CellRange= 0.0.
basis: One-electron integrals computed using PRISM.
basis: NBasis= 859 RedAO= T EigKep= 1.08D-06 NBF= 859
basis: NBsUse= 853 1.00D-06 EigRej= 9.40D-07 NBFU= 853
converged: NO NO NO NO
hfenergy: -1479.2141495 hartree
pointgroup: C01 [X(C32H35N3O1)]
dipole: -4.8748044 -1.8467272 -4.2551443 debye
InChI: InChI=1/32C.3N.O.35H
charge 2 multiplicity 1
71 atoms
C  0.26243326 -1.94558456 0.00437221
C  -0.93261736 -1.79526531 -0.76449333
C  -1.4175684 -0.47809193 -1.07623952
C  -0.65798946 0.61522196 -0.67851858
C  0.53066163 0.43388868 0.03420571
C  1.01873834 -0.86778526 0.40003906
C  -0.5731905 -3.99670446 -0.39418359
C  -1.44145106 -3.08965205 -1.03292649
H  -2.36067754 -0.32639357 -1.58812109
H  -1.0056378 1.6154567 -0.90235721
H  1.10146874 1.29774646 0.34897409
H  1.93055123 -0.97720085 0.96874071
N  0.44417955 -3.32932656 0.2249778
H  -0.66238487 -5.0683617 -0.35753877
C  1.55824149 -3.90961971 0.88663862
O  2.38790821 -3.18173279 1.38855591
C  1.68999922 -5.41037079 0.86851429
H  2.3043173 -5.6554852 1.73596303
H  0.72924864 -5.91858805 0.99052564
C  2.41564301 -5.89442683 -0.41487728
H  2.73010216 -6.92614902 -0.22754947
H  3.32308266 -5.29881288 -0.55392337
C  1.56402111 -5.8530007 -1.65247222
H  0.77981589 -6.60752888 -1.71969049
C  1.7003899 -4.96864481 -2.64280295
H  2.47270082 -4.20320541 -2.61691553
H  1.04722372 -4.9869057 -3.50955573
C  -2.62720969 -3.44423431 -1.75113811
H  -3.18732852 -4.33928423 -1.49935296
N  -3.07324392 -2.71400338 -2.78339907
H  -2.51008812 -1.94010824 -3.11482424
C  -2.63330987 -0.39466074 -5.02902312
C  -3.9335314 -0.69389345 -4.60800224
C  -4.71776887 0.3207114 -4.04748538
C  -4.19807553 1.60102946 -3.88577891
C  -2.89067978 1.88366789 -4.27946547
C  -2.11067918 0.88612352 -4.85810421
H  -2.02387245 -1.16346147 -5.49725551
H  -5.73516037 0.12754697 -3.72291474
H  -4.81546251 2.37674604 -3.44533671
H  -2.48692497 2.88129778 -4.14506002
H  -1.09946538 1.10186268 -5.18565555
C  -4.40560382 -2.12899316 -4.71583854
H  -3.72469323 -2.67250876 -5.37721636
C  -4.4057621 -2.87628635 -3.34148502
H  -4.54485521 -3.94402767 -3.54305457
C  -5.49687488 -2.43932301 -2.37146306
C  -6.70645989 -3.13883409 -2.33373774
C  -5.31446486 -1.35737054 -1.505801
C  -7.73223019 -2.73343314 -1.48014577
H  -6.84373507 -4.0257692 -2.94665128
C  -6.33390538 -0.95320215 -0.65189414
H  -4.37389942 -0.82061946 -1.49719255
C  -7.54989849 -1.63512201 -0.64372095
H  -8.66407683 -3.28762825 -1.45810928
H  -6.17626207 -0.10634452 0.00759809
H  -8.34469339 -1.32035869 0.02398199
C  -5.89930255 -1.3667286 -6.61195601
C  -6.13593573 -3.66334107 -5.79691591
C  -6.85157803 -2.14078297 -7.50440765
H  -4.90733654 -1.28641681 -7.06004069
H  -6.23837301 -0.37778325 -6.31066289
C  -6.3955674 -3.58415307 -7.29860511
H  -7.03447435 -3.93495584 -5.24380709
H  -5.32892402 -4.34219955 -5.52733548
H  -7.88763458 -2.00321223 -7.18039131
H  -6.76935449 -1.8091994 -8.54008458
H  -7.14060557 -4.32034858 -7.60184804
H  -5.47545405 -3.77801156 -7.85677394
N  -5.75704195 -2.24012521 -5.37107828
H  -6.45724024 -1.93200856 -4.689716
