program: Gaussian 16
title: Title Card Required
version: ES64L-G16RevC.02
basis: 6-31+G(d,p)
method: UwB97XD TD-FC
operation: Force
keyword: #p
keyword: td=(nstates=30,root=2)
keyword: uwb97xd/6-31+g(d,p)
keyword: force
keyword: scrf=(CPCM,solvent=chloroform)
keyword: nosymm
keyword: scf=xqc
keyword: Guess=mix
keyword: density=current
title: #p td=(nstates=30,root=2) uwb97xd/6-31+g(d,p) force scrf=(CPCM,solvent
basis: NPDir=0 NMtPBC= 1 NCelOv= 1 NCel= 1 NClECP= 1 NCelD= 1
basis: NCelK= 1 NCelE2= 1 NClLst= 1 CellRange= 0.0.
basis: One-electron integrals computed using PRISM.
basis: NBasis= 859 RedAO= T EigKep= 1.10D-06 NBF= 859
basis: NBsUse= 853 1.00D-06 EigRej= 9.43D-07 NBFU= 853
converged: NO NO NO NO
hfenergy: -1479.2141192 hartree
pointgroup: C01 [X(C32H35N3O1)]
dipole: -3.2937791 -0.2956962 -3.4068543 debye
InChI: InChI=1/32C.3N.O.35H
charge 2 multiplicity 1
71 atoms
C  0.25775609 -1.94696609 0.00484935
C  -0.93108989 -1.79864693 -0.76429152
C  -1.41651308 -0.47822132 -1.06339563
C  -0.65936851 0.61958416 -0.66571131
C  0.53150746 0.43840217 0.03783348
C  1.01243559 -0.86584554 0.39845207
C  -0.56532043 -4.00348113 -0.39899576
C  -1.43564953 -3.09637826 -1.0416079
H  -2.36604881 -0.33174624 -1.56209252
H  -1.01022698 1.62349908 -0.88053666
H  1.11251279 1.30071192 0.34609777
H  1.92652191 -0.98171504 0.96000017
N  0.44316233 -3.33129034 0.22474326
H  -0.6503039 -5.0747006 -0.35888077
C  1.55821966 -3.90735446 0.88547373
O  2.39019856 -3.1766709 1.38162372
C  1.68773304 -5.40843878 0.87104125
H  2.30150894 -5.65538688 1.73891248
H  0.72633166 -5.91323249 0.99406761
C  2.41272162 -5.89335508 -0.41255474
H  2.72776389 -6.92432303 -0.2267278
H  3.32016445 -5.2963608 -0.55172793
C  1.55976083 -5.84888277 -1.64962284
H  0.77158017 -6.600708 -1.71196561
C  1.69316882 -4.96551776 -2.63861794
H  2.46380065 -4.19746187 -2.61577168
H  1.03504808 -4.98181785 -3.50278449
C  -2.61785192 -3.45724769 -1.75968412
H  -3.15828018 -4.36432946 -1.51430433
N  -3.06946134 -2.72163587 -2.7867448
H  -2.50382957 -1.95331021 -3.12392846
C  -2.63805145 -0.3944517 -5.02984808
C  -3.93713761 -0.69366264 -4.60617699
C  -4.71904251 0.32075862 -4.04061001
C  -4.19817849 1.60037572 -3.8788674
C  -2.89217986 1.88327903 -4.278212
C  -2.114073 0.88598436 -4.85920208
H  -2.03069576 -1.16311097 -5.50087675
H  -5.73426759 0.12661748 -3.71042728
H  -4.81269056 2.37539475 -3.43365846
H  -2.48846542 2.88135655 -4.14636209
H  -1.10389214 1.10119312 -5.18952892
C  -4.40859509 -2.12874147 -4.71643216
H  -3.72861697 -2.6690856 -5.38125449
C  -4.40508864 -2.87765242 -3.34224549
H  -4.55026663 -3.94600768 -3.54404288
C  -5.49305742 -2.43888255 -2.37062341
C  -6.70217756 -3.13834173 -2.32967574
C  -5.31071517 -1.35257916 -1.51044392
C  -7.72726022 -2.73048115 -1.47657017
H  -6.84059288 -4.02596161 -2.9413035
C  -6.32872122 -0.94713969 -0.65543379
H  -4.37297458 -0.81072462 -1.50998964
C  -7.54386342 -1.6307108 -0.64254335
H  -8.66011782 -3.28338515 -1.45446934
H  -6.17121831 -0.0972389 0.0003342
H  -8.33707251 -1.31546222 0.02649858
C  -5.9005828 -1.36774903 -6.61692367
C  -6.13802369 -3.66331707 -5.79965088
C  -6.85262847 -2.14292147 -7.5095999
H  -4.90842241 -1.28893723 -7.06464005
H  -6.23927989 -0.3780667 -6.31776187
C  -6.39667147 -3.58582481 -7.30162631
H  -7.03606742 -3.93626235 -5.24641373
H  -5.32982587 -4.34114206 -5.53070752
H  -7.8891283 -2.00505467 -7.18703331
H  -6.7697055 -1.81324391 -8.54602395
H  -7.14080001 -4.32297795 -7.60509414
H  -5.47580745 -3.78003611 -7.85857275
N  -5.76005577 -2.23967178 -5.37390629
H  -6.46176851 -1.92957735 -4.69503653
