program: Gaussian 16
title: Title Card Required
version: ES64L-G16RevC.02
basis: 6-31+G(d,p)
method: UwB97XD TD-FC
operation: Force
keyword: #p
keyword: td=(nstates=30,root=3)
keyword: uwb97xd/6-31+g(d,p)
keyword: force
keyword: scrf=(CPCM,solvent=chloroform)
keyword: nosymm
keyword: scf=xqc
keyword: Guess=mix
keyword: density=current
title: #p td=(nstates=30,root=3) uwb97xd/6-31+g(d,p) force scrf=(CPCM,solvent
basis: NPDir=0 NMtPBC= 1 NCelOv= 1 NCel= 1 NClECP= 1 NCelD= 1
basis: NCelK= 1 NCelE2= 1 NClLst= 1 CellRange= 0.0.
basis: One-electron integrals computed using PRISM.
basis: NBasis= 859 RedAO= T EigKep= 1.06D-06 NBF= 859
basis: NBsUse= 853 1.00D-06 EigRej= 9.58D-07 NBFU= 853
converged: NO NO NO NO
hfenergy: -1479.2145739 hartree
pointgroup: C01 [X(C32H35N3O1)]
dipole: -4.8975615 -1.8412033 -4.2350667 debye
InChI: InChI=1/32C.3N.O.35H
charge 2 multiplicity 1
71 atoms
C  0.25816143 -1.94636636 0.00373741
C  -0.92905748 -1.79316003 -0.76964721
C  -1.39917515 -0.47587291 -1.10109117
C  -0.64407475 0.62311209 -0.70472499
C  0.52805945 0.44013542 0.02847874
C  1.00720423 -0.86281055 0.39990786
C  -0.5844758 -3.99582966 -0.38789788
C  -1.4504557 -3.08480541 -1.02487644
H  -2.33231207 -0.32915296 -1.62918062
H  -0.98344354 1.6230723 -0.94567459
H  1.09591682 1.30526649 0.35171919
H  1.91593161 -0.97270803 0.97162015
N  0.43462507 -3.33121115 0.22587689
H  -0.67615428 -5.067539 -0.34532603
C  1.55025652 -3.91456018 0.884493
O  2.37330767 -3.18335148 1.39168587
C  1.69069933 -5.41538224 0.86098998
H  2.30543288 -5.6602636 1.7291452
H  0.73258464 -5.92778682 0.98150696
C  2.42196841 -5.89853203 -0.41981696
H  2.73753058 -6.92937423 -0.22947091
H  3.32927558 -5.30196158 -0.55622152
C  1.57660717 -5.86092992 -1.66187887
H  0.7938517 -6.61689241 -1.73249715
C  1.72067838 -4.97924002 -2.65263976
H  2.49128074 -4.21208313 -2.62073356
H  1.07635369 -4.99960502 -3.52617497
C  -2.65042421 -3.42419412 -1.72511235
H  -3.23586735 -4.29513935 -1.4478405
N  -3.08165498 -2.70118548 -2.76504907
H  -2.5165781 -1.93054306 -3.10146309
C  -2.62257989 -0.39639574 -5.02307586
C  -3.92560512 -0.69438869 -4.60936503
C  -4.71506072 0.32199602 -4.06001698
C  -4.19781451 1.60332317 -3.90037719
C  -2.8868349 1.88444666 -4.28267947
C  -2.10195949 0.88532154 -4.85228919
H  -2.00952369 -1.16614226 -5.48487206
H  -5.73563516 0.12926289 -3.74499124
H  -4.82038504 2.38104041 -3.47129743
H  -2.4840629 2.8823464 -4.14757549
H  -1.08893259 1.10120073 -5.17368432
C  -4.39963059 -2.12887532 -4.71218084
H  -3.72040276 -2.67627036 -5.37218272
C  -4.4068633 -2.87029337 -3.33508141
H  -4.53544361 -3.93896302 -3.53515504
C  -5.50547178 -2.43939343 -2.37173279
C  -6.71483954 -3.13945157 -2.34378923
C  -5.32452178 -1.36579802 -1.49500723
C  -7.74355788 -2.74060244 -1.49078014
H  -6.85052109 -4.02327884 -2.96153949
C  -6.34730081 -0.96791856 -0.64289823
H  -4.3801483 -0.83600202 -1.47197296
C  -7.56424168 -1.64771121 -0.64632962
H  -8.67452978 -3.29578827 -1.47428681
H  -6.19015607 -0.12852196 0.02610447
H  -8.36231923 -1.33581581 0.01880311
C  -5.89726809 -1.36350438 -6.60284578
C  -6.13239807 -3.66166968 -5.79188344
C  -6.85084312 -2.13614479 -7.49469138
H  -4.90618126 -1.28014977 -7.05233457
H  -6.23671644 -0.37582719 -6.29804767
C  -6.3938811 -3.57985489 -7.2929542
H  -7.03093698 -3.93267898 -5.23866668
H  -5.32645371 -4.34251962 -5.52382951
H  -7.88579389 -1.99995058 -7.16657396
H  -6.77182107 -1.80188138 -8.52975721
H  -7.1392899 -4.31574026 -7.59619331
H  -5.47443111 -3.77274317 -7.85245905
N  -5.75169981 -2.23924622 -5.36484938
H  -6.44982375 -1.9327927 -4.68031214
