program: Gaussian 16
title: Title Card Required
version: ES64L-G16RevC.02
basis: 6-31+G(d,p)
method: UwB97XD TD-FC
operation: Force
keyword: #p
keyword: td=(nstates=30,root=3)
keyword: uwb97xd/6-31+g(d,p)
keyword: force
keyword: scrf=(CPCM,solvent=chloroform)
keyword: nosymm
keyword: scf=xqc
keyword: Guess=mix
keyword: density=current
title: #p td=(nstates=30,root=3) uwb97xd/6-31+g(d,p) force scrf=(CPCM,solvent
basis: NPDir=0 NMtPBC= 1 NCelOv= 1 NCel= 1 NClECP= 1 NCelD= 1
basis: NCelK= 1 NCelE2= 1 NClLst= 1 CellRange= 0.0.
basis: One-electron integrals computed using PRISM.
basis: NBasis= 859 RedAO= T EigKep= 1.06D-06 NBF= 859
basis: NBsUse= 853 1.00D-06 EigRej= 9.57D-07 NBFU= 853
converged: NO NO NO NO
hfenergy: -1479.2143786 hartree
pointgroup: C01 [X(C32H35N3O1)]
dipole: -4.9055183 -1.8401089 -4.2427643 debye
InChI: InChI=1/32C.3N.O.35H
charge 2 multiplicity 1
71 atoms
C  0.25820962 -1.94650491 0.00372232
C  -0.92930341 -1.79440508 -0.7683338
C  -1.4002889 -0.47677109 -1.09840492
C  -0.64554746 0.62202271 -0.70233371
C  0.52733658 0.44107963 0.02912153
C  1.00731178 -0.86390445 0.3989348
C  -0.58372535 -3.9967653 -0.38866136
C  -1.44985778 -3.08578942 -1.02539842
H  -2.33424427 -0.32907764 -1.62570247
H  -0.98615984 1.62246093 -0.94162526
H  1.09503428 1.30546973 0.35200171
H  1.9160733 -0.97267246 0.96989166
N  0.43613951 -3.33217101 0.22590405
H  -0.67544835 -5.06889738 -0.34659108
C  1.55108731 -3.91442581 0.88483412
O  2.37426773 -3.18368793 1.39205421
C  1.6910006 -5.41521337 0.86194258
H  2.30589172 -5.65981335 1.72944305
H  0.73299339 -5.92674768 0.98270269
C  2.42125624 -5.89867314 -0.41970332
H  2.73660631 -6.92907984 -0.22941693
H  3.32870947 -5.30196115 -0.55640046
C  1.57535867 -5.86049109 -1.66094811
H  0.79276688 -6.6165804 -1.73133072
C  1.71882431 -4.97844124 -2.65165224
H  2.48927084 -4.21114338 -2.62002022
H  1.07330036 -4.99811913 -3.52438182
C  -2.64902213 -3.42434951 -1.72635022
H  -3.2315182 -4.29743407 -1.45374574
N  -3.07981073 -2.7014842 -2.76661449
H  -2.51757901 -1.92734208 -3.10267035
C  -2.62351581 -0.39620601 -5.02419394
C  -3.92623639 -0.69429776 -4.60983308
C  -4.71535267 0.32188435 -4.05940618
C  -4.19815969 1.60295623 -3.8990739
C  -2.88700772 1.88411158 -4.28243723
C  -2.10289465 0.8857023 -4.85305117
H  -2.01079858 -1.16553849 -5.48676162
H  -5.73584894 0.1291647 -3.74399433
H  -4.82003862 2.3802556 -3.46897159
H  -2.48424572 2.88212902 -4.14657438
H  -1.0901451 1.10160424 -5.1753618
C  -4.39988199 -2.12919583 -4.71257589
H  -3.72054189 -2.67623084 -5.37296234
C  -4.40599429 -2.86987208 -3.33590121
H  -4.53589332 -3.93920139 -3.53640419
C  -5.50415888 -2.43938461 -2.37138866
C  -6.71404068 -3.13994329 -2.34286396
C  -5.32334981 -1.36587866 -1.49634002
C  -7.74200044 -2.73960679 -1.48924059
H  -6.85032154 -4.02369222 -2.95964763
C  -6.34561318 -0.9661501 -0.64386503
H  -4.37892092 -0.83561341 -1.47371519
C  -7.56301569 -1.64655188 -0.64657328
H  -8.6735133 -3.29531174 -1.47163575
H  -6.18829988 -0.12643349 0.02391079
H  -8.36035839 -1.33367255 0.01918726
C  -5.89727707 -1.3638575 -6.60333369
C  -6.13269088 -3.66198999 -5.7923249
C  -6.85080076 -2.13660748 -7.49543835
H  -4.90622402 -1.28071711 -7.05262041
H  -6.23672004 -0.3762223 -6.2986754
C  -6.39402799 -3.58031512 -7.29338145
H  -7.0312634 -3.93286635 -5.23904651
H  -5.32681533 -4.34289925 -5.52390962
H  -7.88577687 -2.00015819 -7.16760443
H  -6.77113825 -1.80239115 -8.53050615
H  -7.13956249 -4.31615527 -7.59653952
H  -5.4744406 -3.77348595 -7.85283723
N  -5.75188292 -2.2396104 -5.36525635
H  -6.44999278 -1.93310881 -4.68092607
