program: Gaussian 16
title: Title Card Required
version: ES64L-G16RevC.02
basis: 6-31+G(d,p)
method: UwB97XD TD-FC
operation: Force
keyword: #p
keyword: td=(nstates=30,root=2)
keyword: uwb97xd/6-31+g(d,p)
keyword: force
keyword: scrf=(CPCM,solvent=chloroform)
keyword: nosymm
keyword: scf=xqc
keyword: Guess=mix
keyword: density=current
title: #p td=(nstates=30,root=2) uwb97xd/6-31+g(d,p) force scrf=(CPCM,solvent
basis: NPDir=0 NMtPBC= 1 NCelOv= 1 NCel= 1 NClECP= 1 NCelD= 1
basis: NCelK= 1 NCelE2= 1 NClLst= 1 CellRange= 0.0.
basis: One-electron integrals computed using PRISM.
basis: NBasis= 859 RedAO= T EigKep= 1.08D-06 NBF= 859
basis: NBsUse= 853 1.00D-06 EigRej= 9.42D-07 NBFU= 853
converged: NO NO NO NO
hfenergy: -1479.2143353 hartree
pointgroup: C01 [X(C32H35N3O1)]
dipole: -3.2707509 -0.2778923 -3.3792418 debye
InChI: InChI=1/32C.3N.O.35H
charge 2 multiplicity 1
71 atoms
C  0.26299466 -1.94609279 0.00415049
C  -0.93302722 -1.79459221 -0.76496258
C  -1.41490303 -0.47805231 -1.08171272
C  -0.65548044 0.61533915 -0.68405734
C  0.52951192 0.43425565 0.03266856
C  1.01674707 -0.86616488 0.39935819
C  -0.57533473 -3.99707058 -0.39237581
C  -1.44500157 -3.08935368 -1.03068891
H  -2.35696377 -0.32588201 -1.59897832
H  -1.00233995 1.6159861 -0.91183339
H  1.09953704 1.30074871 0.35085556
H  1.92963888 -0.97597592 0.97046006
N  0.4431179 -3.3288785 0.22504007
H  -0.66741759 -5.07190738 -0.35574797
C  1.55796683 -3.91058848 0.88715277
O  2.38610547 -3.1828449 1.39093216
C  1.68972289 -5.41101038 0.86741698
H  2.3050677 -5.6559618 1.73404543
H  0.73064466 -5.92099478 0.98881566
C  2.4171853 -5.89570508 -0.41627526
H  2.73151572 -6.9269433 -0.22817064
H  3.32400759 -5.30003802 -0.55482809
C  1.56681919 -5.85443038 -1.6546938
H  0.78309189 -6.61031017 -1.72253029
C  1.70442632 -4.97116397 -2.64433927
H  2.47666391 -4.20513233 -2.61738079
H  1.05281141 -4.98931043 -3.51297139
C  -2.63286645 -3.43761735 -1.74516776
H  -3.19761961 -4.32761997 -1.49022159
N  -3.07414506 -2.71024034 -2.78058281
H  -2.51206187 -1.93366176 -3.11152363
C  -2.63081867 -0.39490671 -5.02819816
C  -3.93187629 -0.6939593 -4.60869858
C  -4.71726767 0.32081259 -4.05039859
C  -4.19819599 1.6015247 -3.88894585
C  -2.89001546 1.88379303 -4.2802585
C  -2.10879827 0.88596988 -4.85739348
H  -2.02071532 -1.16368302 -5.49544507
H  -5.73547404 0.12800721 -3.72861787
H  -4.81673458 2.3773937 -3.45078092
H  -2.48620447 2.88139428 -4.14467703
H  -1.09730391 1.10211892 -5.18372584
C  -4.40455942 -2.12944157 -4.7155058
H  -3.72328324 -2.67371383 -5.3757668
C  -4.40647729 -2.87501562 -3.34161542
H  -4.542893 -3.94339305 -3.54212982
C  -5.49876675 -2.43998366 -2.37171022
C  -6.70823125 -3.13926465 -2.33531241
C  -5.31600887 -1.35956332 -1.50329966
C  -7.73448335 -2.7347795 -1.48196667
H  -6.84537889 -4.02553292 -2.94950263
C  -6.33616066 -0.95588381 -0.65025233
H  -4.37465473 -0.82476364 -1.4913066
C  -7.55288721 -1.63718727 -0.64473531
H  -8.66608311 -3.28965359 -1.46035452
H  -6.17877205 -0.11083037 0.01115989
H  -8.34826372 -1.32306193 0.02296986
C  -5.89883944 -1.36620842 -6.60976812
C  -6.13509131 -3.66332504 -5.79571051
C  -6.8512895 -2.13980227 -7.50205269
H  -4.90679035 -1.28515048 -7.05800105
H  -6.2379166 -0.37754839 -6.30739944
C  -6.39509133 -3.58333334 -7.29717764
H  -7.03372197 -3.93436446 -5.24262791
H  -5.3284263 -4.3427326 -5.52615318
H  -7.88695411 -2.0023979 -7.1773363
H  -6.76936923 -1.80744969 -8.53737066
H  -7.14042309 -4.31921273 -7.60041122
H  -5.47522031 -3.77709774 -7.85590242
N  -5.75567936 -2.24011486 -5.37001164
H  -6.45512191 -1.93271557 -4.68727043
