program: Gaussian 16
title: Title Card Required
version: ES64L-G16RevC.02
basis: 6-31+G(d,p)
method: UwB97XD TD-FC
operation: Force
keyword: #p
keyword: td=(nstates=30,root=2)
keyword: uwb97xd/6-31+g(d,p)
keyword: force
keyword: scrf=(CPCM,solvent=chloroform)
keyword: nosymm
keyword: scf=xqc
keyword: Guess=mix
keyword: density=current
title: #p td=(nstates=30,root=2) uwb97xd/6-31+g(d,p) force scrf=(CPCM,solvent
basis: NPDir=0 NMtPBC= 1 NCelOv= 1 NCel= 1 NClECP= 1 NCelD= 1
basis: NCelK= 1 NCelE2= 1 NClLst= 1 CellRange= 0.0.
basis: One-electron integrals computed using PRISM.
basis: NBasis= 859 RedAO= T EigKep= 1.11D-06 NBF= 859
basis: NBsUse= 852 1.00D-06 EigRej= 9.48D-07 NBFU= 852
converged: NO NO NO NO
hfenergy: -1479.0073143 hartree
pointgroup: C01 [X(C32H35N3O1)]
dipole: -2.6405361 0.0318469 -2.9592627 debye
InChI: InChI=1/32C.3N.O.35H
charge 2 multiplicity 1
71 atoms
C  0.28479966 -1.99335258 0.01787752
C  -0.98445554 -1.84319468 -0.80045916
C  -1.41776203 -0.45845498 -1.04586009
C  -0.72488161 0.53813651 -0.67596339
C  0.6339099 0.37098629 0.1043564
C  1.04116123 -0.75015038 0.41789311
C  -0.73421439 -3.95023543 -0.51844895
C  -1.39986213 -3.14882963 -0.98790306
H  -2.37437239 -0.34924715 -1.5329508
H  -1.00602214 1.60539503 -0.86908857
H  1.12519022 1.29209934 0.34437896
H  1.94538684 -0.97775461 0.96569736
N  0.55481855 -3.2476631 0.28466608
H  -0.63900183 -5.07727439 -0.37455616
C  1.54963169 -3.85418105 0.87404012
O  2.42688824 -3.16841574 1.39774426
C  1.68700418 -5.40312324 0.86776439
H  2.29157254 -5.65283883 1.74606086
H  0.71839845 -5.89558775 0.99031904
C  2.40831991 -5.88570539 -0.40410657
H  2.72131925 -6.9178809 -0.22623579
H  3.31661349 -5.29265423 -0.55306145
C  1.55030455 -5.84690668 -1.63779915
H  0.76582657 -6.59476718 -1.70511934
C  1.68501961 -4.95359117 -2.64167751
H  2.45718574 -4.19617707 -2.61522208
H  1.02835061 -4.97981704 -3.4988259
C  -2.66435703 -3.49107217 -1.80104887
H  -3.12180481 -4.38969803 -1.52473235
N  -3.04652365 -2.75312207 -2.8080966
H  -2.50745264 -1.98010428 -3.15531618
C  -2.6438598 -0.3934904 -5.02902419
C  -3.94220109 -0.69331473 -4.60270391
C  -4.71823693 0.32064506 -4.03264398
C  -4.19618952 1.60095355 -3.87054173
C  -2.89397813 1.88407312 -4.27678389
C  -2.11777961 0.88524357 -4.85945387
H  -2.03679349 -1.16319657 -5.49900101
H  -5.72932246 0.12481844 -3.68956749
H  -4.8103201 2.37563066 -3.42419706
H  -2.49068704 2.88230094 -4.14949637
H  -1.10759507 1.09973996 -5.1916238
C  -4.414941 -2.13040426 -4.71523467
H  -3.73231558 -2.66654939 -5.37978384
C  -4.39153844 -2.88646282 -3.34088263
H  -4.5874732 -3.94521822 -3.55960521
C  -5.48587623 -2.4335623 -2.37447717
C  -6.69350515 -3.1307424 -2.32507393
C  -5.30882958 -1.34439361 -1.51424802
C  -7.72342119 -2.72528979 -1.47424562
H  -6.82932116 -4.02088305 -2.936159
C  -6.32556038 -0.94028955 -0.65655279
H  -4.37791369 -0.79040561 -1.52438347
C  -7.53934921 -1.62693907 -0.64157155
H  -8.65493684 -3.2798462 -1.45588368
H  -6.17180903 -0.09016369 -0.00023419
H  -8.3319376 -1.31371412 0.02877464
C  -5.90242238 -1.3701586 -6.61937261
C  -6.13875867 -3.66153671 -5.80149027
C  -6.85389822 -2.14557198 -7.51475589
H  -4.9098353 -1.29442289 -7.06849737
H  -6.24008467 -0.37781562 -6.32624014
C  -6.39733745 -3.58777468 -7.30320084
H  -7.0362809 -3.93759347 -5.24745036
H  -5.32940588 -4.33825557 -5.53131653
H  -7.89093875 -2.00784195 -7.19305906
H  -6.76936776 -1.81662014 -8.55104551
H  -7.13971572 -4.32655821 -7.60631722
H  -5.47508208 -3.78095119 -7.85902637
N  -5.76517332 -2.2352522 -5.38005694
H  -6.46682437 -1.92927273 -4.69970659
