program: Gaussian 16
title: Title Card Required
version: ES64L-G16RevC.02
basis: 6-31+G(d,p)
method: UwB97XD TD-FC
operation: Force
keyword: #p
keyword: td=(nstates=30,root=3)
keyword: uwb97xd/6-31+g(d,p)
keyword: force
keyword: scrf=(CPCM,solvent=chloroform)
keyword: nosymm
keyword: scf=xqc
keyword: Guess=mix
keyword: density=current
title: #p td=(nstates=30,root=3) uwb97xd/6-31+g(d,p) force scrf=(CPCM,solvent
basis: NPDir=0 NMtPBC= 1 NCelOv= 1 NCel= 1 NClECP= 1 NCelD= 1
basis: NCelK= 1 NCelE2= 1 NClLst= 1 CellRange= 0.0.
basis: One-electron integrals computed using PRISM.
basis: NBasis= 859 RedAO= T EigKep= 1.10D-06 NBF= 859
basis: NBsUse= 853 1.00D-06 EigRej= 9.32D-07 NBFU= 853
converged: NO NO NO NO
hfenergy: -1479.21366 hartree
pointgroup: C01 [X(C32H35N3O1)]
dipole: -3.2715501 -0.2992106 -3.4027889 debye
InChI: InChI=1/32C.3N.O.35H
charge 2 multiplicity 1
71 atoms
C  0.26224149 -1.94886213 0.00748547
C  -0.9313004 -1.79963099 -0.757394
C  -1.42467028 -0.47722158 -1.05167719
C  -0.6647079 0.61109948 -0.65780416
C  0.53640566 0.43093803 0.04015581
C  1.02360161 -0.87028192 0.40246182
C  -0.55978574 -3.99465141 -0.39913211
C  -1.43231289 -3.09491533 -1.04226341
H  -2.3736387 -0.32779161 -1.54851494
H  -1.01342972 1.61440252 -0.87110691
H  1.11467948 1.29102501 0.34145292
H  1.93545153 -0.98341661 0.96662396
N  0.4494728 -3.3302734 0.22388539
H  -0.64686327 -5.06800951 -0.36628103
C  1.56501087 -3.90405475 0.88604256
O  2.39833273 -3.17436387 1.38089668
C  1.68927415 -5.40414834 0.87412049
H  2.29815901 -5.65637848 1.74432374
H  0.72213281 -5.89663896 0.99309955
C  2.41110332 -5.88907379 -0.41084139
H  2.723762 -6.92056427 -0.22568837
H  3.31962885 -5.29386655 -0.55330513
C  1.55460379 -5.84532163 -1.64415588
H  0.76746202 -6.59629309 -1.70643855
C  1.68731365 -4.96044432 -2.63740434
H  2.45864474 -4.19510506 -2.61481802
H  1.02986506 -4.98013709 -3.50007067
C  -2.60597911 -3.46868725 -1.77162366
H  -3.1455411 -4.37828377 -1.52324368
N  -3.06669523 -2.74297043 -2.7968065
H  -2.50604665 -1.96704639 -3.13603597
C  -2.64115969 -0.39437463 -5.0293156
C  -3.93949774 -0.69357725 -4.60361193
C  -4.71924856 0.32058765 -4.03453596
C  -4.19784898 1.60020573 -3.87425276
C  -2.89322356 1.88338025 -4.27769358
C  -2.11647127 0.88570098 -4.85939961
H  -2.0344347 -1.16330051 -5.50075813
H  -5.73235453 0.12604902 -3.69828984
H  -4.81092452 2.3752339 -3.42703564
H  -2.48956403 2.88191893 -4.14820448
H  -1.10650185 1.10006318 -5.19092095
C  -4.4114533 -2.12860743 -4.71737176
H  -3.73167929 -2.66710204 -5.38380987
C  -4.40813291 -2.881991 -3.34601876
H  -4.5723476 -3.94734583 -3.55470939
C  -5.48945522 -2.43612881 -2.37061819
C  -6.69872172 -3.13555118 -2.32824091
C  -5.30896489 -1.34676215 -1.51395842
C  -7.72467343 -2.72778362 -1.47573748
H  -6.8352614 -4.02375935 -2.93851631
C  -6.32630886 -0.94323602 -0.65710109
H  -4.37479705 -0.79790875 -1.51866955
C  -7.54079867 -1.62849448 -0.6418262
H  -8.65680998 -3.28133251 -1.45451258
H  -6.16992037 -0.09315802 -0.00138618
H  -8.33347562 -1.31363463 0.02827467
C  -5.90185235 -1.36851272 -6.62028102
C  -6.13925455 -3.66289883 -5.80117423
C  -6.85355294 -2.14446886 -7.51295793
H  -4.9093258 -1.29166594 -7.06765796
H  -6.23989912 -0.37787793 -6.32323325
C  -6.39717291 -3.5869559 -7.30331214
H  -7.03662678 -3.93707074 -5.24743396
H  -5.32995206 -4.33919463 -5.53243607
H  -7.89036731 -2.00676338 -7.191257
H  -6.76997546 -1.81566236 -8.54970555
H  -7.14023687 -4.32538885 -7.60638763
H  -5.47554352 -3.7809566 -7.85907629
N  -5.76259986 -2.23874718 -5.3760333
H  -6.46561132 -1.92822904 -4.69858376
