program: Gaussian 16
title: Title Card Required
version: ES64L-G16RevC.02
basis: 6-31+G(d,p)
method: UwB97XD TD-FC
operation: Force
keyword: #p
keyword: td=(nstates=30,root=3)
keyword: uwb97xd/6-31+g(d,p)
keyword: force
keyword: scrf=(CPCM,solvent=chloroform)
keyword: nosymm
keyword: scf=xqc
keyword: Guess=mix
keyword: density=current
title: #p td=(nstates=30,root=3) uwb97xd/6-31+g(d,p) force scrf=(CPCM,solvent
basis: NPDir=0 NMtPBC= 1 NCelOv= 1 NCel= 1 NClECP= 1 NCelD= 1
basis: NCelK= 1 NCelE2= 1 NClLst= 1 CellRange= 0.0.
basis: One-electron integrals computed using PRISM.
basis: NBasis= 859 RedAO= T EigKep= 1.10D-06 NBF= 859
basis: NBsUse= 853 1.00D-06 EigRej= 9.29D-07 NBFU= 853
converged: NO NO NO NO
hfenergy: -1479.2132657 hartree
pointgroup: C01 [X(C32H35N3O1)]
dipole: -4.8569021 -1.8548311 -4.2757424 debye
InChI: InChI=1/32C.3N.O.35H
charge 2 multiplicity 1
71 atoms
C  0.26851445 -1.94699574 0.01100764
C  -0.93606612 -1.79760608 -0.75962879
C  -1.42639674 -0.4792186 -1.05003668
C  -0.66506138 0.60986159 -0.65648655
C  0.53653049 0.42733945 0.04027611
C  1.02541726 -0.87350466 0.40354213
C  -0.56082192 -3.99535012 -0.39978395
C  -1.43340028 -3.09443649 -1.04207335
H  -2.3773028 -0.32717299 -1.54742981
H  -1.01420288 1.61144275 -0.87071986
H  1.1163535 1.29234497 0.34170181
H  1.94007875 -0.98385553 0.96973676
N  0.45165076 -3.32552409 0.22425491
H  -0.64728984 -5.06709992 -0.36897514
C  1.56881614 -3.90467362 0.88724784
O  2.40077437 -3.17477845 1.3817237
C  1.6900757 -5.40136088 0.8754456
H  2.2972009 -5.65653167 1.74527186
H  0.72176695 -5.89409427 0.99247061
C  2.41134404 -5.88792748 -0.41097806
H  2.72310271 -6.92020639 -0.22554377
H  3.31903286 -5.29368686 -0.55333317
C  1.55367298 -5.84325403 -1.64444285
H  0.76688469 -6.59626843 -1.70603401
C  1.68612358 -4.96104141 -2.63542641
H  2.45844604 -4.19477122 -2.61487681
H  1.02916756 -4.97998943 -3.50031117
C  -2.60486237 -3.47143544 -1.77343284
H  -3.14539784 -4.37983669 -1.52421245
N  -3.06632903 -2.7460615 -2.80084089
H  -2.50711738 -1.96990698 -3.13810236
C  -2.64147634 -0.39434451 -5.02924219
C  -3.94012737 -0.69343347 -4.60332357
C  -4.71909115 0.32026418 -4.0334709
C  -4.19761669 1.60022687 -3.87352665
C  -2.89348136 1.88350559 -4.27759652
C  -2.11674891 0.88546516 -4.85948624
H  -2.03481631 -1.16322803 -5.50050092
H  -5.73195229 0.12594279 -3.69627027
H  -4.81071462 2.37529205 -3.42631469
H  -2.48973808 2.88202526 -4.14847393
H  -1.10677772 1.09994127 -5.19103966
C  -4.41201076 -2.12847195 -4.71727081
H  -3.73191916 -2.66689 -5.38380259
C  -4.40951258 -2.88452456 -3.34759537
H  -4.57600238 -3.94659134 -3.5566885
C  -5.4894041 -2.4352526 -2.37080594
C  -6.69820963 -3.13458448 -2.3278587
C  -5.30821842 -1.3454731 -1.5143687
C  -7.72388465 -2.72757996 -1.47590302
H  -6.83416473 -4.02338314 -2.93806512
C  -6.32586764 -0.94278172 -0.6571551
H  -4.37549812 -0.79560021 -1.51976352
C  -7.54017035 -1.62811764 -0.64172407
H  -8.65635646 -3.28109855 -1.45476251
H  -6.17007946 -0.09271035 -0.00143786
H  -8.33317663 -1.31350266 0.02842259
C  -5.90217535 -1.36863689 -6.62082244
C  -6.13934917 -3.66289889 -5.80139471
C  -6.8537711 -2.14464424 -7.51345617
H  -4.90947878 -1.2922243 -7.0679706
H  -6.23999895 -0.37775899 -6.32403536
C  -6.3972068 -3.5871155 -7.30347386
H  -7.03656413 -3.93715347 -5.24749678
H  -5.32996845 -4.33884849 -5.53244793
H  -7.89048007 -2.00700887 -7.19171938
H  -6.7698531 -1.81595006 -8.55005531
H  -7.14011189 -4.3256713 -7.60636981
H  -5.47538367 -3.78103341 -7.85908821
N  -5.76304849 -2.23862962 -5.3763787
H  -6.46612528 -1.9281897 -4.69908409
