program: Gaussian 16
title: Title Card Required
version: ES64L-G16RevC.02
basis: 6-31+G(d,p)
method: UwB97XD TD-FC
operation: Force
keyword: #p
keyword: td=(nstates=30,root=3)
keyword: uwb97xd/6-31+g(d,p)
keyword: force
keyword: scrf=(CPCM,solvent=chloroform)
keyword: nosymm
keyword: scf=xqc
keyword: Guess=mix
keyword: density=current
title: #p td=(nstates=30,root=3) uwb97xd/6-31+g(d,p) force scrf=(CPCM,solvent
basis: NPDir=0 NMtPBC= 1 NCelOv= 1 NCel= 1 NClECP= 1 NCelD= 1
basis: NCelK= 1 NCelE2= 1 NClLst= 1 CellRange= 0.0.
basis: One-electron integrals computed using PRISM.
basis: NBasis= 859 RedAO= T EigKep= 1.10D-06 NBF= 859
basis: NBsUse= 853 1.00D-06 EigRej= 9.26D-07 NBFU= 853
converged: NO NO NO NO
hfenergy: -1479.2117414 hartree
pointgroup: C01[X(C32H35N3O1)]
dipole: -3.2158937 -0.3189414 -3.3661097 debye
InChI: InChI=1/32C.3N.O.35H
charge 2 multiplicity 1
71 atoms
C  0.27081251 -1.94559884 0.0123655
C  -0.93720771 -1.79907994 -0.76032051
C  -1.42991792 -0.47787747 -1.05063103
C  -0.66577826 0.60865712 -0.65603181
C  0.53845138 0.42939338 0.04119797
C  1.02888447 -0.8766304 0.40600914
C  -0.56218986 -3.99972115 -0.40006326
C  -1.43444278 -3.09298078 -1.04216613
H  -2.37940804 -0.32720772 -1.546555
H  -1.01472633 1.60980893 -0.87064873
H  1.11676889 1.29231182 0.34156957
H  1.94241477 -0.98405459 0.9712209
N  0.45248131 -3.3222428 0.22395209
H  -0.64749816 -5.06570003 -0.37085828
C  1.57276919 -3.90372125 0.8891594
O  2.40214403 -3.17563987 1.38213667
C  1.69065962 -5.40014965 0.87545158
H  2.29659895 -5.65650367 1.74596949
H  0.72146133 -5.89285013 0.99206992
C  2.41111475 -5.88732026 -0.41080657
H  2.72267895 -6.91989328 -0.22554203
H  3.31875269 -5.29349996 -0.55329714
C  1.55270415 -5.84376565 -1.64288222
H  0.76682139 -6.59602532 -1.70585122
C  1.68575883 -4.95963701 -2.63618809
H  2.45807861 -4.19493811 -2.61489377
H  1.02898274 -4.97995086 -3.50014196
C  -2.60494292 -3.47444203 -1.77395951
H  -3.14513489 -4.38014 -1.52466589
N  -3.06532186 -2.74601494 -2.80472853
H  -2.50840111 -1.97263611 -3.13876026
C  -2.64177342 -0.39435887 -5.02911452
C  -3.94035083 -0.69358201 -4.60317933
C  -4.71904121 0.32027394 -4.03270738
C  -4.19747108 1.60008855 -3.87313974
C  -2.89364422 1.88360328 -4.27755644
C  -2.11681524 0.88538719 -4.85957007
H  -2.03496679 -1.16320606 -5.50037269
H  -5.73169885 0.12586544 -3.69507319
H  -4.81063834 2.37537855 -3.42589676
H  -2.48984263 2.88206551 -4.14862143
H  -1.10692526 1.09988114 -5.19109779
C  -4.41230211 -2.12813668 -4.71751391
H  -3.73200561 -2.66674446 -5.38368911
C  -4.41101738 -2.88612027 -3.348296
H  -4.57811851 -3.94647924 -3.5579128
C  -5.48925373 -2.43470361 -2.37106803
C  -6.69780492 -3.13405604 -2.32764165
C  -5.30783867 -1.34484168 -1.51459538
C  -7.72354604 -2.72748437 -1.47596061
H  -6.83349283 -4.02315809 -2.93780089
C  -6.32570116 -0.94272601 -0.65728017
H  -4.37574355 -0.79402313 -1.52035631
C  -7.53979062 -1.62769924 -0.6415328
H  -8.65599819 -3.28092846 -1.45496211
H  -6.17020961 -0.0923282 -0.00134915
H  -8.33289836 -1.31352902 0.02837363
C  -5.90227733 -1.36862171 -6.62121325
C  -6.13938002 -3.66291228 -5.80154285
C  -6.85386272 -2.14477074 -7.51366531
H  -4.90961632 -1.2925786 -7.06811293
H  -6.24005202 -0.3777107 -6.32449416
C  -6.3971889 -3.58722665 -7.30353855
H  -7.03651968 -3.93719005 -5.24751591
H  -5.32996295 -4.33868504 -5.53243127
H  -7.89056506 -2.00714239 -7.19197144
H  -6.76974804 -1.81609922 -8.55022393
H  -7.14002937 -4.32581242 -7.60632553
H  -5.47529382 -3.78106599 -7.85908269
N  -5.76346348 -2.23863982 -5.37648826
H  -6.46634582 -1.928201 -4.69939765
