program: Gaussian 16
title: Title Card Required
version: ES64L-G16RevC.02
basis: 6-31+G(d,p)
method: UwB97XD TD-FC
operation: Force
keyword: #p
keyword: td=(nstates=30,root=2)
keyword: uwb97xd/6-31+g(d,p)
keyword: force
keyword: scrf=(CPCM,solvent=chloroform)
keyword: nosymm
keyword: scf=xqc
keyword: Guess=mix
keyword: density=current
title: #p td=(nstates=30,root=2) uwb97xd/6-31+g(d,p) force scrf=(CPCM,solvent
basis: NPDir=0 NMtPBC= 1 NCelOv= 1 NCel= 1 NClECP= 1 NCelD= 1
basis: NCelK= 1 NCelE2= 1 NClLst= 1 CellRange= 0.0.
basis: One-electron integrals computed using PRISM.
basis: NBasis= 859 RedAO= T EigKep= 1.08D-06 NBF= 859
basis: NBsUse= 853 1.00D-06 EigRej= 9.36D-07 NBFU= 853
converged: NO NO NO NO
hfenergy: -1479.2053332 hartree
pointgroup: C01[X(C32H35N3O1)]
dipole: -4.3548523 -1.7412262 -3.9672201 debye
InChI: InChI=1/32C.3N.O.35H
charge 2 multiplicity 1
71 atoms
C  0.27589205 -1.94789305 0.01694404
C  -0.94741402 -1.78158712 -0.76630829
C  -1.42298789 -0.48295288 -1.04362433
C  -0.67288132 0.59920575 -0.65793074
C  0.54507484 0.43932994 0.04389088
C  1.04749059 -0.88574732 0.41993801
C  -0.55138291 -4.00829977 -0.39343698
C  -1.44111095 -3.09588496 -1.04751873
H  -2.39706815 -0.32666104 -1.54846113
H  -1.01588375 1.60773671 -0.8708117
H  1.11897062 1.29504106 0.34197229
H  1.94310076 -0.98496928 0.97114848
N  0.44898231 -3.3205618 0.22102049
H  -0.64922438 -5.07128697 -0.37750546
C  1.59047912 -3.89479305 0.89751704
O  2.40649746 -3.18103803 1.38358746
C  1.69087005 -5.3907484 0.87546282
H  2.29424163 -5.65613745 1.74750693
H  0.71921407 -5.89250535 0.99055999
C  2.41043914 -5.88693661 -0.41034801
H  2.72205122 -6.91962292 -0.22605683
H  3.31751949 -5.29295085 -0.55294225
C  1.55097438 -5.84026522 -1.64246304
H  0.76589523 -6.59652006 -1.70541541
C  1.68377263 -4.96053364 -2.633182
H  2.45815906 -4.19436974 -2.615184
H  1.02782903 -4.97974212 -3.50100107
C  -2.6084873 -3.47421685 -1.77241696
H  -3.14425459 -4.38086254 -1.52517662
N  -3.08711051 -2.76627822 -2.81981773
H  -2.50000868 -1.96683004 -3.14633893
C  -2.64273951 -0.39351881 -5.02836797
C  -3.94056087 -0.69286714 -4.60248458
C  -4.7181502 0.3195017 -4.03026185
C  -4.19721885 1.60009134 -3.87185356
C  -2.89398244 1.88331739 -4.2777714
C  -2.11764698 0.88478213 -4.8598013
H  -2.03492427 -1.16347516 -5.50015137
H  -5.73139433 0.12559594 -3.69131651
H  -4.8103974 2.37552211 -3.42487728
H  -2.49011135 2.88236824 -4.14892419
H  -1.10684379 1.09981988 -5.19135432
C  -4.41559565 -2.12877704 -4.71671761
H  -3.73137408 -2.66656131 -5.38330845
C  -4.40636244 -2.88222186 -3.34884448
H  -4.58279175 -3.95015027 -3.56149397
C  -5.48930021 -2.43261907 -2.37028286
C  -6.69656985 -3.13273698 -2.32692459
C  -5.30693765 -1.34405946 -1.51584711
C  -7.72216714 -2.72671926 -1.47613156
H  -6.83151242 -4.02236978 -2.93681145
C  -6.32419974 -0.94227993 -0.65790928
H  -4.37571479 -0.78830467 -1.52194942
C  -7.53912951 -1.62734305 -0.64160765
H  -8.65477515 -3.28036626 -1.45569975
H  -6.17089054 -0.09126623 -0.00095537
H  -8.33234866 -1.31368495 0.02836135
C  -5.90327554 -1.36901368 -6.62244008
C  -6.13898663 -3.66314486 -5.80177003
C  -6.85384981 -2.14493737 -7.51428363
H  -4.90975633 -1.29375629 -7.06849531
H  -6.24024179 -0.37746296 -6.32580265
C  -6.39724954 -3.58751785 -7.30354589
H  -7.03653768 -3.93731589 -5.24747924
H  -5.3299845 -4.338344 -5.53234735
H  -7.8907855 -2.00749251 -7.19267141
H  -6.76934082 -1.81657751 -8.55019681
H  -7.13963631 -4.3260066 -7.606013
H  -5.47490778 -3.7811457 -7.85909743
N  -5.76391498 -2.23824487 -5.37842459
H  -6.46735842 -1.92810465 -4.69956233
