program: Gaussian 16
title: Title Card Required
version: ES64L-G16RevC.02
method: UwB97XD
basis: 6-31+G(d,p)
operation: Freq
keyword: #P
keyword: Geom=AllCheck
keyword: Guess=TCheck
keyword: SCRF=Check
keyword: GenChk
keyword: UwB97XD/6-31+G(d,p)
keyword: Freq
converged: YES YES YES YES
polarizability: 2.47680752e+02 -5.23345836e+00 2.86444120e+02 2.87296041e+01 -2.25048021e+00 2.03332569e+02
1716.lowfreq: -26.6839 -10.7645 -0.0004 0.0004 0.0007 33.8937 39.9971 65.1988 81.9186
frequency: 37.5492 64.4053 81.3690 95.1256 116.2762 129.8698 143.6406 166.0543 209.5605 230.3105 275.0373 288.1744 289.5711 301.5940 319.8902 388.2821 403.9208 437.9905 444.9618 464.2823 481.6550 531.6146 570.4950 588.8276 589.5320 633.6844 634.2342 670.4590 695.8938 742.4563 755.1694 756.1226 786.1006 799.2738 850.5166 870.8157 875.0884 887.5981 902.5204 907.1922 940.7794 949.5516 980.2887 990.2026 998.6833 999.7353 1021.3670 1022.8247 1025.8865 1032.4691 1040.1272 1047.1916 1059.6231 1064.7064 1065.9930 1081.7751 1089.2779 1099.6948 1111.1907 1128.5689 1133.3719 1149.5544 1152.1281 1195.5844 1200.3240 1216.4272 1220.5319 1228.5421 1242.6334 1250.3613 1277.4042 1295.1059 1304.0228 1309.3045 1349.3585 1354.9708 1364.3269 1371.1157 1379.1878 1387.8436 1391.9141 1410.7938 1418.4560 1427.7558 1442.2182 1471.0569 1488.3255 1497.0593 1507.6556 1509.8790 1515.9998 1533.4684 1544.9297 1548.0078 1560.1452 1562.6573 1665.3335 1668.8047 1671.4560 1684.1627 1684.5124 1724.5556 3090.4881 3108.2514 3126.5995 3139.0507 3145.4506 3176.0373 3178.4306 3187.9309 3207.9709 3214.5051 3218.4644 3219.8790 3221.1296 3226.4195 3232.2900 3234.2688 3242.0238 3242.3364 3250.1786 3251.5886 3427.6245 3479.5933 3531.8439 3576.0602
redmass: 4.5732 4.4492 4.1665 3.7007 2.5264 3.4783 3.1266 3.9469 3.4769 3.2721 3.9190 2.0611 3.5704 3.1607 3.1873 1.4417 3.8971 2.8771 3.1381 2.5903 3.3728 3.3814 4.1800 3.5954 2.0310 6.3490 6.1692 3.4568 3.8616 2.5318 3.4089 1.7259 1.5630 2.2015 1.5198 2.4356 2.4430 2.7321 1.2854 1.2669 2.2619 2.5126 1.5157 1.4395 1.7406 1.4016 4.7786 5.1387 3.9422 1.4415 1.3411 1.4112 2.8774 2.4318 2.5498 1.8418 1.4757 1.7465 1.4210 1.5914 1.5740 1.5639 1.6099 1.1109 1.1190 1.1312 1.5155 1.6740 1.4332 1.5138 1.4921 1.2629 2.2504 1.2719 1.8822 1.8055 1.8251 1.9707 1.5571 1.3252 1.2672 1.3405 1.3100 1.4190 1.1765 1.3559 1.2581 1.1252 1.9758 1.8974 1.0955 1.1043 1.5825 1.3809 1.4840 1.4678 3.3316 5.3620 1.2077 4.9732 4.8250 1.0895 1.0705 1.0877 1.0623 1.0629 1.0603 1.0859 1.0997 1.1067 1.0899 1.1100 1.0886 1.0896 1.0896 1.1057 1.0903 1.0906 1.0949 1.0952 1.0995 1.0994 1.0437 1.0763 1.0814 1.0891
irintensity: 3.7725 0.5887 0.7811 2.0327 1.1771 0.6278 0.0306 6.7196 7.8214 10.6089 8.4990 5.3495 9.3099 20.8331 6.9739 2.9221 10.8308 2.9069 0.6290 2.5466 23.4283 6.0169 1.4784 19.0962 1.5533 0.0570 0.8973 11.5982 3.2832 4.0292 24.8885 127.9559 4.4884 59.8848 5.2649 6.0213 7.8581 11.5662 0.6000 0.2332 6.9079 10.3245 9.3772 3.6357 11.1401 6.0032 24.6994 5.2767 7.8953 2.1634 0.5513 5.9140 29.7355 25.7824 7.2371 2.2028 17.8303 12.7003 11.4861 51.3782 4.0400 5.6859 10.7230 0.1081 0.9813 2.5986 2.0684 7.1540 15.5133 21.2184 23.5699 4.2332 6.2555 1.6053 4.7824 1.4294 13.7005 3.0124 12.3545 2.0962 2.8003 9.6614 33.5562 22.1864 53.9359 8.2579 43.1461 19.3717 26.9823 8.2772 25.5355 10.1311 3.9175 17.0211 134.4069 84.8217 5.3695 2.1519 53.6752 3.5187 0.7329 69.7909 13.3697 2.1416 17.5552 5.5018 7.3043 3.4263 2.8390 6.1717 3.0371 3.6856 5.2088 12.7888 0.9001 1.8136 2.8225 2.8834 10.6978 4.7604 4.0509 4.0556 89.7507 95.9898 204.5329 140.0825
temp: 298.150 k
press: 1.00000 atm
elementType: 6 6 6 6 6 6 1 1 1 1 1 6 1 6 1 6 6 6 6 1 6 1 6 1 1 1 7 1 1 6 6 6 1 1 6 1 1 1 1 1 1 7 1 1
symmnumber: 1
zpe: 1061127.8 jmol-1
zpe.correction: 0.404162 hartree
zpe.thermalcorrener: 0.420721 hartree
zpe.thermalcorrenthalpy: 0.421665 hartree
zpe.thermalcorrgfe: 0.360311 hartree
zpe.sumelectzpe: -808.914222 hartree
zpe.sumelectthermal: -808.897663 hartree
zpe.sumelectthermalent: -808.896719 hartree
zpe.sumelectthermalfe: -808.958073 hartree
dipole: -4.5358 -14.7751 -2.3604
dipole: 15.6349
quadrupole: -77.7072 -51.0090 -75.5932
quadrupole: 12.0362 -2.6827 -6.1119
quadrupole: -9.6041 17.0942 -7.4901 12.0362 -2.6827 -6.1119
hfenergy: -809.3183843 hartree
pointgroup: C01 [X(C18H24N2)]
dipole: -1.5043256 -0.8920791 -2.8449952 debye
polarizability: 247.6807523|-5.2334584|286.4441197|28.7296041|-2.2504802|203.3325685 unknown
InChI: InChI=1/18C.2N.24H
charge 2 multiplicity 1
44 atoms
C  -1.54369021 1.12365168 -0.2151153
C  -0.86311024 0.07244591 0.40869261
C  0.0329173 0.35737771 1.4460657
C  0.25222549 1.67267632 1.8393208
C  -0.412418 2.71748166 1.19795807
C  -1.31116143 2.44248945 0.17164786
H  -2.27488686 0.91941234 -0.99414288
H  0.57213724 -0.43477167 1.95743798
H  0.94481848 1.881027 2.64721714
H  -0.2368829 3.74202312 1.50714496
H  -1.84530158 3.24811739 -0.31950481
C  -1.10298318 -1.33260145 -0.09892023
H  -2.05520686 -1.35119417 -0.63898925
C  0.01750772 -1.85051384 -1.06038821
H  -0.32208175 -2.77740233 -1.52485932
C  1.37390879 -2.08526278 -0.43238979
C  1.74755791 -3.39772107 -0.12229384
C  2.26328176 -1.03841959 -0.16243755
C  2.97342757 -3.65671713 0.48501397
H  1.09912532 -4.2294479 -0.38328246
C  3.49333786 -1.30192007 0.43122482
H  2.00985467 -0.00899004 -0.39637213
C  3.845272 -2.60813546 0.76607914
H  3.25156328 -4.6781055 0.71916214
H  4.17538872 -0.48384092 0.633998
H  4.80451051 -2.8089117 1.23036835
N  0.13040477 -0.87412601 -2.20256691
H  0.96719739 -1.07803445 -2.75669298
H  -0.67155361 -0.92519788 -2.83718073
C  -2.24213656 -1.86496829 2.10208265
C  -1.78068683 -3.70466818 0.56942097
C  -2.67276289 -3.16555683 2.75038034
H  -3.07145087 -1.36330822 1.59988769
H  -1.73252841 -1.15951122 2.7537918
C  -2.89833228 -4.08155178 1.54704017
H  -0.93403871 -4.38746228 0.61759563
H  -2.12570824 -3.63076293 -0.46158263
H  -1.88158433 -3.55132717 3.40043887
H  -3.57039578 -3.02601344 3.35300966
H  -2.85162361 -5.14037119 1.80183755
H  -3.8735537 -3.881528 1.09769093
N  -1.28238875 -2.32489895 1.01623041
H  -0.36919291 -2.46201086 1.46153236
H  0.19827672 0.09825873 -1.87700154
