program: Orca
programVersion: 6.0.1
elementType: C O O
charge: 0
multiplicity: 1
keywords: wB97M-V def2-TZVPPD VeryTightSCF
formula: CO2
InChI: InChI=1/CO2/c2-1-3
3 atoms
C  7.559607 4.507856 10.269075
O  6.785481 4.828445 11.064044
O  8.336931 4.190525 9.470813
totalener: -188.62432671052301 hartree
nucrepener: 58.55580489205759 hartree
electener: -247.27188710275354 hartree
oneelecener: -373.11288728844994 hartree
twoeener: 125.84100018569640 hartree
kineticenergy: 188.18646745790213 hartree
xcener: -16.315513305783 hartree
energy: -528.4379 -528.4153 -286.8343 -35.4434 -34.2767 -18.7139 -17.4558 -17.4557 -17.4417 -13.1588 -13.1588 0.4523 1.9246 2.0055 2.0055 2.8051 3.1131 3.1131 3.3549 3.3551 4.4273 5.9072 electronvolt
chargesum: -0.0000000
charge: 0.719877 -0.356686 -0.363191
charge: -0.414832 0.209552 0.205281
qa: 0.7199 -0.3567 -0.3632
va: 3.8016 2.2134 2.2041
energy: -188.624326710523
