program: Orca
programVersion: 6.0.1
elementType: C O O
charge: 0
multiplicity: 1
keywords: wB97M-V def2-TZVPPD VeryTightSCF SMD(triethylamine)
formula: CO2
InChI: InChI=1/CO2/c2-1-3
3 atoms
C  7.678738 4.835379 10.152972
O  6.96752 5.36347 10.891213
O  8.397529 4.313006 9.406927
totalener: -188.62644519601290 hartree
nucrepener: 58.56026750996543 hartree
electener: -247.27626592492567 hartree
oneelecener: -373.10724465023003 hartree
twoeener: 125.83097872530436 hartree
cpcmener: -0.00120529995602 hartree
kineticenergy: 188.18218113318665 hartree
energy: -528.3527 -528.3091 -286.7537 -35.3489 -34.1788 -18.6431 -17.3762 -17.3521 -17.3521 -13.0720 -13.0719 0.5185 1.8599 2.0596 2.0599 2.7973 3.0957 3.0958 3.4612 3.4621 4.4988 6.0866 electronvolt
chargesum: -0.0000000
charge: 0.735301 -0.360723 -0.374579
charge: -0.410108 0.209591 0.200516
qa: 0.7353 -0.3607 -0.3746
va: 3.7912 2.2130 2.1934
energy: -188.626445196013
