program: Orca
programVersion: 6.0.1
elementType: C O O
charge: 0
multiplicity: 1
keywords: wB97M-V def2-TZVPPD VeryTightSCF SMD(triethylamine)
formula: CO2
InChI: InChI=1/CO2/c2-1-3
3 atoms
C  7.770905 4.691396 10.061175
O  7.0711 5.216693 10.815257
O  8.475611 4.174057 9.301659
totalener: -188.62647698607009 hartree
nucrepener: 58.56420454713907 hartree
electener: -247.28023774905552 hartree
oneelecener: -373.11507080006623 hartree
twoeener: 125.83483305101070 hartree
cpcmener: -0.00120202496509 hartree
kineticenergy: 188.18278029403524 hartree
energy: -528.3400 -528.3215 -286.7527 -35.3458 -34.1843 -18.6425 -17.3770 -17.3525 -17.3525 -13.0728 -13.0728 0.5185 1.8599 2.0595 2.0598 2.7972 3.0957 3.0958 3.4623 3.4633 4.4993 6.0863 electronvolt
chargesum: 0.0000000
charge: 0.735140 -0.364698 -0.370443
charge: -0.410289 0.207025 0.203263
qa: 0.7351 -0.3647 -0.3704
va: 3.7912 2.2073 2.1992
energy: -188.626476986070
