program: Orca
programVersion: 6.0.1
elementType: Zn N N N N C H C C C C C C H C C H C H C C H C H C H C C H N N N N C H C C C C C C H C C H C H C C H C H C H C C H
charge: 0
multiplicity: 1
keywords: wB97M-V def2-TZVPPD VeryTightSCF SMD(acetonitrile)
formula: C32H16N8Zn
InChI: InChI=1/C32H16N8.Zn/c1-2-10-18-17(9-1)25-33-26(18)38-28-21-13-5-6-14-22(21)30(35-28)40-32-24-16-8-7-15-23(24)31(36-32)39-29-20-12-4-3-11-19(20)27(34-29)37-25;/h1-16H;/q-4;+4/rC32H16N8Zn/c1-2-10-18-17(9-1)25-33-27-19-11-3-4-12-20(19)29-35-31-23-15-7-8-16-24(23)32-36-30-22-14-6-5-13-21(22)28-34-26(18)37(25)41(38(27)29,39(28)30)40(31)32/h1-16H
57 atoms
Zn 8.386694 1.641079 9.412523
N  11.734619 1.537806 9.318451
N  8.481089 1.615706 12.767725
N  7.018948 1.629523 10.862129
N  9.829322 1.582365 10.780226
C  12.656544 1.584745 14.409418
H  12.98243 1.59183 15.44339
C  10.930247 1.589663 12.781873
C  11.157746 1.560955 10.507172
C  11.891687 1.566026 11.762759
C  11.749851 1.499648 6.868794
C  11.090437 1.528018 8.16486
C  13.616565 1.560933 13.391976
H  14.667701 1.550152 13.657168
C  10.730687 1.498957 5.907036
C  13.086025 1.476473 6.498099
H  13.874704 1.476845 7.2416
C  11.30129 1.599112 14.118184
H  10.557961 1.617199 14.906816
C  7.291909 1.619482 12.191857
C  11.023684 1.475139 4.551561
H  10.235783 1.474482 3.807221
C  13.24733 1.550903 12.055872
H  13.99146 1.53215 11.267997
C  13.377203 1.453205 5.142899
H  14.41114 1.435064 4.817338
C  9.634115 1.59905 12.122561
C  12.359779 1.452536 4.18266
H  12.624873 1.433925 3.131609
N  5.031402 1.60799 9.513234
N  8.285951 1.534405 6.064831
N  9.748508 1.542876 7.968935
N  6.937203 1.578418 8.05205
C  4.110909 1.54588 4.422265
H  3.785354 1.533179 3.388244
C  5.836767 1.557146 6.050254
C  5.60845 1.591835 8.324654
C  4.874917 1.579294 7.069002
C  5.017104 1.609121 11.962843
C  5.675546 1.615102 10.666819
C  3.150483 1.568192 5.439365
H  2.099379 1.572224 5.173856
C  6.036372 1.612104 12.924678
C  3.680598 1.600204 12.333865
H  2.8920 1.597015 11.590301
C  5.466137 1.539685 4.71391
H  6.209775 1.522065 3.925562
C  9.475114 1.526713 6.640748
C  5.743037 1.606191 14.280537
H  6.530953 1.607597 15.024846
C  3.519271 1.584872 6.775516
H  2.774817 1.601776 7.563129
C  3.389435 1.596045 13.688986
H  2.355437 1.590102 14.014803
C  7.132834 1.555924 6.709935
C  4.407039 1.599005 14.649406
H  4.141706 1.595309 15.700552
totalener: -3446.64582716949735 hartree
nucrepener: 5068.09971077671526 hartree
electener: -8515.77760470256908 hartree
twoeener: 6319.83948575958220 hartree
cpcmener: -0.02749776251016 hartree
kineticenergy: 3440.07955515450385 hartree
energy: -9464.4753 -1155.3955 -1015.9887 -1015.7410 -1015.7407 -395.2597 -395.2589 -395.2586 -395.2513 -395.1321 -395.1319 -395.1314 -395.1313 -283.8790 -283.8786 -283.8779 -283.8776 -283.8767 -283.8766 -283.8740 -283.8735 -281.9626 -281.9605 -281.9605 -281.9604 -281.9497 -281.9476 -281.9476 -281.9475 -281.8736 -281.8731 -281.8727 -281.8726 -281.8721 -281.8721 -281.8719 -281.8714 -281.7796 -281.7788 -281.7787 -281.7781 -281.7665 -281.7657 -281.7657 -281.7650 -135.5055 -91.0501 -90.7575 -90.7573 -31.3356 -30.9353 -30.9313 -30.1467 -29.5440 -28.3796 -28.3769 -27.4771 -26.9767 -26.9536 -26.9524 -26.9347 -24.6912 -24.2970 -24.2625 -24.2610 -24.1319 -24.1314 -24.1163 -24.0343 -23.1245 -22.4051 -22.4041 -20.8587 -20.6833 -20.4743 -20.4733 -20.3329 -20.2405 -19.6035 -19.5240 -19.5237 -19.2124 -18.4267 -18.2318 -18.2290 -17.8610 -17.7931 -17.7922 -16.8401 -16.7992 -16.7958 -16.7244 -16.4945 -16.4924 -16.1689 -16.1198 -16.1178 -15.8047 -15.7218 -15.7214 -15.7197 -15.5185 -15.4707 -15.4698 -15.4120 -15.0723 -14.8953 -14.8952 -14.8674 -14.8012 -14.5755 -14.5300 -14.5289 -14.2174 -13.8824 -13.7690 -13.1596 -13.1593 -13.1417 -12.7958 -12.7445 -12.7435 -12.6274 -12.5464 -12.5440 -12.5049 -12.3510 -12.0362 -12.0349 -12.0028 -11.6653 -11.6631 -11.5302 -10.6783 -10.6762 -10.2568 -10.1682 -9.7167 -9.6568 -9.6284 -9.6031 -9.6025 -9.3785 -9.3762 -9.3262 -9.2178 -6.4066 -1.5985 -1.5980 0.6853 0.6957 0.7603 0.8810 0.8814 0.9925 1.2058 1.2062 1.2293 electronvolt
chargesum: -0.0000000
charge: -0.376205 -0.756598 -0.782646 -0.467761 -0.480801 -0.605582 0.300289 0.528011 0.253662 0.686305 0.419449 0.463353 -0.493279 0.309746 0.618758 -0.286082 0.324773 -0.225624 0.337874 0.334460 -0.343139 0.329117 -0.384019 0.331208 -0.539543 0.308412 0.289995 -0.544419 0.311921 -0.769114 -0.763050 -0.452164 -0.473197 -0.509831 0.318155 0.516298 0.296219 0.572132 0.447588 0.303224 -0.576782 0.307094 0.684029 -0.168061 0.339484 -0.270900 0.324040 0.271726 -0.435491 0.316222 -0.345389 0.341841 -0.582437 0.303840 0.345094 -0.513029 0.310822
charge: 0.812630 0.194857 0.194698 0.083215 0.082635 0.021833 0.009903 -0.092905 -0.264644 -0.092640 -0.092714 -0.264556 0.021788 0.009896 -0.092480 0.068045 0.017359 0.068009 0.017331 -0.264680 0.068071 0.017374 0.067991 0.017338 0.021896 0.009918 -0.264616 0.021844 0.009917 0.194696 0.194859 0.082397 0.082699 0.021850 0.009901 -0.092902 -0.264647 -0.092673 -0.093113 -0.264603 0.021780 0.009899 -0.092833 0.067981 0.017344 0.067984 0.017320 -0.264639 0.067944 0.017337 0.068034 0.017334 0.021791 0.009887 -0.264565 0.021743 0.009882
qa: -0.3762 -0.7566 -0.7826 -0.4678 -0.4808 -0.6056 0.3003 0.5280 0.2537 0.6863 0.4194 0.4634 -0.4933 0.3097 0.6188 -0.2861 0.3248 -0.2256 0.3379 0.3345 -0.3431 0.3291 -0.3840 0.3312 -0.5395 0.3084 0.2900 -0.5444 0.3119 -0.7691 -0.7631 -0.4522 -0.4732 -0.5098 0.3182 0.5163 0.2962 0.5721 0.4476 0.3032 -0.5768 0.3071 0.6840 -0.1681 0.3395 -0.2709 0.3240 0.2717 -0.4355 0.3162 -0.3454 0.3418 -0.5824 0.3038 0.3451 -0.5130 0.3108
va: 2.6990 1.5738 1.4941 2.0101 1.9839 3.1076 0.8988 1.4692 0.6791 0.9185 1.4714 0.4705 3.0389 0.8740 1.1201 2.7139 0.8794 2.6582 0.8686 0.3083 2.7236 0.8825 2.6670 0.8880 2.9979 0.8852 0.5453 3.0482 0.8816 1.5132 1.5520 2.0164 1.9668 3.1185 0.8709 1.2139 0.5353 1.3044 1.5945 0.6215 3.0949 0.8886 0.9284 2.6815 0.8664 2.7814 0.8932 0.4702 2.6408 0.8955 2.6251 0.8654 3.0437 0.8938 0.5296 3.0265 0.8756
energy: -3446.645827169497
