program: Gaussian 09
title: 000049676
version: EM64L-G09RevD.01
frameworkgroup: C1[X(C22H25NO3)]
method: RPBEPBE
basis: SDD
operation: Freq
keyword: #p
keyword: freq=noraman
keyword: PBEPBE/SDD
title: #p freq=noraman PBEPBE/SDD
converged: YES YES NO NO
title: Mulliken charges:
elementType: O O O N C C C C C C C C C C C C C C C C C C C C C C H H H H H H H H H H H H H H H H H H H H H H H H H
charge: -0.275250 -0.265277 -0.254634 -0.106096 -0.458303 0.211712 0.078323 0.218385 -0.297734 -0.297236 0.175105 0.012844 0.118105 0.166177 -0.420181 -0.385858 -0.702096 -0.727570 0.266950 -0.826780 -0.381382 -0.370490 -0.536514 -0.244756 -0.235518 -0.243324 0.228610 0.226827 0.175606 0.225209 0.170617 0.212115 0.281020 0.244168 0.227658 0.210105 0.211685 0.243029 0.224161 0.213693 0.231453 0.276052 0.238002 0.256224 0.294119 0.225461 0.226617 0.247509 0.230117 0.230261 0.231078
chargesum: 0.00000
title: Mulliken charges with hydrogens summed into heavy atoms:
elementType: O O O N C C C C C C C C C C C C C C C C C C C C C C
charge: -0.275250 -0.265277 -0.254634 -0.106096 -0.002866 0.211712 0.078323 0.218385 0.103080 0.085496 0.175105 0.012844 0.118105 0.166177 -0.139161 -0.141689 -0.052648 -0.046687 0.266950 -0.081272 -0.125158 -0.076371 0.163073 -0.014638 -0.005257 -0.012246
polarizability: 3.62575666e+02 1.96406546e+01 3.09355003e+02 3.06190134e+00 1.01258611e+01 1.53398044e+02
1716.lowfreq: 0.0002 0.0005 0.0007 1.0355 4.9309 7.5923 25.0899 30.4449 44.9357
frequency: 24.9865 30.1675 44.9238 54.6881 62.0762 68.2088 73.7633 84.9928 94.7449 98.7862 115.6936 144.6654 166.1727 180.5814 194.7655 208.2124 227.0995 235.0323 243.9629 249.2223 273.7105 279.3645 288.6353 293.9968 320.3418 337.3195 343.7222 355.5264 364.2290 369.6835 410.8124 432.1328 462.4604 474.7759 476.0798 518.6751 558.7137 582.2244 604.2027 611.6252 613.1582 634.3139 643.1361 663.9391 705.7672 706.8510 723.3148 748.9632 779.6306 784.3317 794.9870 800.6554 808.2545 827.6170 862.0769 873.4571 916.1230 936.3979 942.3066 973.7283 975.4428 981.3636 987.3266 988.8266 995.4190 1006.9969 1025.2464 1038.3889 1040.3530 1055.5099 1065.8023 1075.9013 1088.0032 1089.9219 1110.9567 1114.4884 1125.1559 1145.2826 1161.0851 1175.2360 1180.3492 1186.1912 1199.5287 1203.7265 1216.4508 1247.5861 1259.3170 1277.3560 1280.9198 1283.3531 1326.8821 1355.5212 1362.2560 1369.0779 1376.3308 1381.1446 1388.8155 1392.8422 1397.0582 1399.2955 1425.7661 1434.7965 1438.9248 1453.9854 1464.4649 1468.0638 1468.8376 1469.5001 1470.9048 1473.1072 1477.3689 1478.7898 1483.7639 1488.0769 1489.5035 1495.9864 1540.6532 1571.7911 1582.4486 1602.2505 1612.2662 1620.2906 2827.1923 2853.9337 2919.4732 2967.5793 2980.1124 2983.9531 2988.9383 3036.8941 3037.9224 3047.1247 3059.4590 3062.3829 3077.1146 3080.2456 3087.6767 3093.1213 3102.8046 3123.9537 3128.0508 3132.6920 3143.7684 3153.2823 3158.9779 3173.8952 3175.1993
redmass: 4.4221 3.6753 3.4573 2.7577 3.5515 3.0109 3.4411 3.4407 2.3483 3.9275 4.2729 3.4358 3.5191 2.7614 1.2822 1.8114 1.9401 1.5145 1.4681 2.6786 3.1294 2.2729 3.6727 3.1775 5.1715 3.2030 3.0494 3.4652 4.6404 4.5404 2.9062 3.1318 4.0100 6.3722 3.2871 4.0036 5.2397 6.2252 6.2050 6.2865 6.2123 5.2588 5.4158 5.1838 1.8566 4.1433 5.3340 3.1833 2.0796 3.2774 3.2351 1.2790 1.3065 1.7055 1.2420 3.4393 2.5781 2.8380 1.5785 2.6733 1.3498 3.0123 4.8791 1.4336 2.5420 1.3241 2.8090 2.0915 1.5059 2.7840 2.5939 2.0520 1.8291 1.9475 1.2608 2.9350 2.2057 1.4361 2.1518 1.0562 1.5268 2.2909 1.3439 2.2011 2.4755 5.5470 1.8641 1.9270 1.1813 1.1474 1.4558 3.5314 1.2961 1.3723 1.4942 6.5132 1.2244 1.2279 1.2884 5.8144 2.7332 2.2961 1.3882 1.0790 1.0798 1.0722 1.0859 1.1339 1.0890 1.0679 1.1518 1.1852 1.8543 1.8069 1.1435 1.0656 9.3159 7.2372 6.0781 8.1714 5.9772 7.6447 1.0720 1.0712 1.0691 1.0325 1.0398 1.0357 1.0359 1.0879 1.0861 1.0890 1.1043 1.0926 1.0981 1.0976 1.1002 1.0997 1.1004 1.0865 1.1001 1.0893 1.0941 1.0877 1.0976 1.0958 1.0972
irintensity: 1.0933 0.1016 1.0053 0.7214 1.0813 1.0319 0.1395 0.2752 0.4331 0.2433 7.6079 3.7662 1.5557 0.7426 1.4493 0.2862 1.5509 0.7312 1.7456 0.6170 1.1931 2.2941 0.3261 1.1883 0.4912 2.8239 0.9422 5.0116 0.4053 2.3982 0.2541 7.0724 6.6949 3.7593 2.2836 14.7704 4.4097 3.9736 5.6538 1.9955 1.1398 7.1173 1.9474 6.9655 40.4306 15.6992 20.8847 24.1954 28.3300 21.9092 4.8570 7.4111 1.6124 24.0629 2.1168 1.4223 1.9501 6.0468 3.9915 16.8427 0.9856 1.7684 0.1908 2.6291 4.8987 1.5256 3.8775 12.2237 6.5646 88.1634 46.8218 27.2736 60.1055 53.1008 0.1913 93.0173 39.3737 3.6752 34.5259 0.1877 44.3274 30.7115 13.1429 25.4606 20.6250 133.7371 13.3068 9.8162 13.5616 4.8649 27.7199 260.0194 3.4655 14.3751 1.2834 31.5701 16.5878 20.5386 48.5015 72.6175 28.1468 19.7411 10.7759 29.5666 17.6335 2.0331 20.6056 21.0111 26.5046 8.2018 7.5897 3.6100 7.6971 0.5942 10.0854 12.4254 200.9152 10.4946 11.3527 151.3587 44.4199 145.6349 107.5869 127.6492 61.2942 81.8958 24.9587 29.5182 26.3215 11.7834 11.6490 9.8850 38.5606 14.7279 30.9681 64.2807 53.7863 31.3326 5.6617 5.0104 20.5654 6.8652 7.7700 0.8630 37.5020 15.0613 16.4050
temp: 298.150 k
press: 1.00000 atm
elementType: 8 8 8 7 6 6 6 6 6 6 6 6 6 6 6 6 6 6 6 6 6 6 6 6 6 6 1 1 1 1 1 1 1 1 1 1 1 1 1 1 1 1 1 1 1 1 1 1 1 1 1
symmnumber: 1
zpe: 1097202.8 jmol-1
zpe.correction: 0.417902 hartree
zpe.thermalcorrener: 0.443333 hartree
zpe.thermalcorrenthalpy: 0.444277 hartree
zpe.thermalcorrgfe: 0.362112 hartree
zpe.sumelectzpe: -1131.837324 hartree
zpe.sumelectthermal: -1131.811894 hartree
zpe.sumelectthermalent: -1131.810950 hartree
zpe.sumelectthermalfe: -1131.893115 hartree
dipole: 2.2875 -3.6851 -0.7944
dipole: 4.4095
quadrupole: -114.6444 -165.8463 -157.3071
quadrupole: 6.1697 1.1231 -4.1131
quadrupole: 31.2882 -19.9137 -11.3745 6.1697 1.1231 -4.1131
hfenergy: -1132.2552262 hartree
pointgroup: C01 [X(C22H25N1O3)]
dipole: 0.6628777 1.6015428 0.0731482 debye
polarizability: 366.3744561|-11.3208818|304.487319|-15.1338797|-9.2390703|154.4669375 unknown
InChI: InChI=1S/C22H25NO3/c1-5-23(6-2)14-18-19(25-4)13-12-17-20(24)15(3)21(26-22(17)18)16-10-8-7-9-11-16/h7-13H,5-6,14H2,1-4H3
charge 0 multiplicity 1
51 atoms
O  -0.467299 -0.229832 0.550759
O  4.144972 0.997033 0.443077
O  0.35188 -4.278023 0.099657
N  0.785292 2.466361 -0.505729
C  1.45334 1.840203 0.683961
C  1.838886 0.384467 0.4879
C  0.863474 -0.641374 0.43741
C  1.176001 -2.018024 0.300419
C  1.617442 2.358115 -1.73923
C  0.430779 3.88613 -0.213644
C  3.194525 -0.032727 0.400035
C  0.098733 -3.029392 0.226631
C  -1.291723 -2.515025 0.27155
C  -1.524007 -1.157913 0.438551
C  2.542406 -2.382464 0.220291
C  3.547938 -1.408691 0.270866
C  0.830488 2.660649 -3.028458
C  -0.567141 4.064718 0.947033
C  -2.812841 -0.42741 0.472714
C  -2.385173 -3.541616 0.070915
C  -3.993192 -0.99118 1.029387
C  -2.861842 0.896384 -0.053099
C  5.563873 0.635774 0.361653
C  -5.198784 -0.258108 1.039016
C  -4.071429 1.620069 -0.046242
C  -5.246319 1.046194 0.49518
H  0.733697 1.892187 1.519177
H  2.364835 2.410165 0.977139
H  2.52065 3.019057 -1.679845
H  1.988904 1.319562 -1.794018
H  1.353372 4.490952 -0.003024
H  -0.02208 4.305769 -1.129361
H  2.777087 -3.446384 0.11454
H  4.596567 -1.710903 0.207726
H  -0.076421 2.031704 -3.074614
H  0.521814 3.718821 -3.102208
H  1.455402 2.437867 -3.913113
H  -1.449584 3.416605 0.805797
H  -0.122735 3.829087 1.930008
H  -0.909515 5.115339 0.985562
H  -2.737854 -3.958248 1.033988
H  -1.963489 -4.388887 -0.495467
H  -3.2550 -3.12901 -0.466538
H  -3.964708 -1.985459 1.482747
H  -1.944276 1.339967 -0.457183
H  5.795538 0.128266 -0.594094
H  5.863895 -0.008139 1.210136
H  6.102255 1.59327 0.413298
H  -6.098483 -0.702502 1.478622
H  -4.098895 2.632914 -0.463627
H  -6.185056 1.611282 0.500846
