program: Gaussian 09
title: 000049704
version: EM64L-G09RevD.01
frameworkgroup: C1[X(C23H25NO3)]
method: RPBEPBE
basis: SDD
operation: Freq
keyword: #p
keyword: freq=noraman
keyword: PBEPBE/SDD
title: #p freq=noraman PBEPBE/SDD
converged: NO YES NO NO
title: Mulliken charges:
elementType: O O O N C C C C C C C C C C C C C C C C C C C C C C C H H H H H H H H H H H H H H H H H H H H H H H H H
charge: -0.286538 -0.286337 -0.250906 -0.099931 -0.364463 -0.357206 -0.404303 -0.393591 -0.398311 -0.499458 0.319562 -0.515289 0.095032 0.339431 -0.346595 0.115244 -0.370690 0.128843 0.194608 0.043567 0.176156 -0.825871 -0.521003 -0.357985 -0.359429 -0.250802 -0.209631 0.225705 0.180986 0.168625 0.208937 0.212447 0.196615 0.192590 0.205104 0.189027 0.217091 0.214969 0.227361 0.300324 0.250473 0.258822 0.236089 0.273716 0.234487 0.280883 0.222299 0.237718 0.222799 0.259781 0.234619 0.234430
chargesum: 0.00000
title: Mulliken charges with hydrogens summed into heavy atoms:
elementType: O O O N C C C C C C C C C C C C C C C C C C C C C C C
charge: -0.286538 -0.286337 -0.250906 -0.099931 0.042228 0.020356 0.004759 0.004103 0.007807 -0.057128 0.319562 -0.214966 0.095032 0.339431 -0.096122 0.115244 -0.111868 0.128843 0.194608 0.043567 0.176156 -0.081579 0.161812 -0.077103 -0.099648 -0.016184 0.024799
polarizability: 3.91441975e+02 -2.36274135e+01 3.05868894e+02 1.72508750e+00 -5.19373170e-01 1.55633169e+02
1716.lowfreq: -14.9273 -5.5547 -2.3580 0.0007 0.0008 0.0009 13.1707 30.4817 33.9461
frequency: 12.1227 30.3262 33.8460 42.8175 55.5090 63.4680 74.2273 85.6499 104.8392 129.7562 140.9280 160.8405 182.2143 194.3736 203.3289 216.9439 223.4134 251.7455 268.3141 275.6462 288.3637 306.5014 312.6879 335.3815 350.4030 385.6362 394.8859 416.2416 422.5667 440.7810 446.8444 454.1299 490.2794 493.9074 525.7481 540.3961 555.1825 574.3010 583.1270 625.5124 629.6764 657.2988 670.1541 693.4372 737.3604 750.5106 765.3832 772.6804 775.6136 792.7427 806.1605 836.5675 849.4698 853.7810 857.3251 881.0678 883.4504 909.1593 936.3485 959.1724 959.6570 969.0941 970.3283 975.2724 992.1130 998.2676 999.7677 1022.9168 1028.1438 1040.0587 1045.9805 1078.8589 1084.7910 1096.9095 1101.5058 1111.3258 1115.4178 1120.4056 1148.3975 1150.5180 1154.2878 1160.8122 1162.3202 1184.8421 1192.7672 1204.1898 1212.6620 1234.3979 1254.0312 1264.0461 1266.1814 1282.0994 1288.6293 1292.8742 1325.8331 1335.1110 1341.7222 1342.2685 1350.2164 1362.9130 1373.7756 1389.8619 1394.7809 1402.9656 1415.8902 1433.7067 1445.9498 1451.7066 1453.6818 1459.7548 1461.4148 1461.9993 1463.3597 1467.8306 1469.5626 1472.9097 1476.6479 1480.0857 1485.0791 1540.9333 1566.1381 1577.9933 1603.9170 1611.6716 1620.4576 2826.1849 2838.5403 2881.1072 2957.8006 2968.0619 2980.5167 2981.3091 2985.6460 2986.5279 3018.0595 3032.9960 3038.0824 3044.0967 3045.9117 3054.8868 3063.1873 3103.2234 3117.2073 3138.1980 3150.6767 3151.9281 3165.3248 3170.1712 3174.8596 3175.3485
redmass: 4.8593 4.0863 4.1126 4.3357 3.4945 2.9449 4.2840 4.6890 3.9518 3.8403 3.8294 1.1714 1.8754 4.3411 1.7199 2.8564 3.1638 2.2777 5.1998 4.6730 3.5762 3.3608 2.2987 3.6240 4.4639 2.4558 2.8550 5.1921 4.3403 3.3003 2.8996 3.5912 6.3703 2.9717 3.7666 7.2203 3.9678 2.4898 5.1523 6.0206 5.6672 4.3526 6.5059 4.0503 5.0616 4.1310 1.8470 4.4186 4.1530 2.4105 1.4760 2.7803 1.9786 2.5952 1.4424 1.4769 3.6582 2.6843 1.4695 5.6081 1.3045 1.4810 1.3667 3.6625 2.2536 2.0527 1.3268 2.0236 1.8922 1.5086 2.1470 1.8708 1.9049 2.4847 2.5021 1.2504 2.4132 2.7035 1.3836 1.3294 1.8078 1.4863 1.3810 2.0411 1.3646 2.3133 3.2433 2.1546 1.4513 1.3297 1.3079 1.4026 2.0236 1.4487 1.4353 1.3961 1.4519 4.5244 1.4963 1.5088 2.3966 2.1459 1.2541 9.6666 3.2616 1.2473 2.3454 1.1583 1.1366 1.0852 1.5422 1.2751 1.1568 1.0904 1.0814 1.4874 1.1107 1.4049 1.1904 8.5164 6.5943 7.6830 7.4600 6.7766 7.2208 1.0712 1.0704 1.0679 1.0318 1.0633 1.0876 1.0402 1.0622 1.0611 1.0870 1.0907 1.0929 1.1039 1.1031 1.1037 1.0929 1.1005 1.1004 1.0861 1.0883 1.0900 1.0954 1.0909 1.0964 1.1001
irintensity: 0.6252 0.4719 0.0893 0.2132 0.2977 4.9075 2.9500 3.9145 1.5088 0.9621 1.3404 0.0500 1.2961 2.2098 3.3028 2.2597 3.7455 1.3468 2.3021 1.2910 2.6415 4.3385 3.0010 2.9352 5.0116 4.7206 0.8638 1.3956 2.3769 6.1201 3.8774 9.2777 1.0762 1.1499 3.4589 12.0823 6.6540 2.1731 2.2001 9.4233 5.3554 3.5579 7.5329 12.7394 0.0725 16.8817 79.5936 2.7145 4.6250 12.4874 0.0839 13.3467 23.1051 2.3412 6.0319 0.5439 20.6039 4.6124 12.0540 58.3257 4.6834 7.2339 3.2404 36.8744 17.1837 15.5077 0.1984 5.0124 10.8182 8.2719 15.4911 44.1027 46.2798 0.8734 71.4773 1.3896 55.4314 3.6356 5.3114 4.4377 5.6824 31.2113 22.7285 28.2527 4.5816 75.1849 29.7824 79.4112 1.1109 2.5603 1.5639 13.8390 17.3268 8.7869 48.2228 9.6312 12.5344 227.8156 4.0875 11.0287 36.2470 16.6370 31.4222 7.4216 30.9899 8.9192 65.4840 15.9271 20.6543 12.5698 16.9573 1.7349 32.6338 6.3153 13.5033 57.6929 3.8366 49.8151 0.3313 208.0933 2.5386 3.5999 171.7927 19.7710 33.8640 62.0983 145.3879 78.6419 74.9217 43.3541 26.7759 23.8528 25.5983 21.3991 63.0302 67.4409 26.8176 48.0035 21.1069 103.4516 13.1620 6.7048 32.7967 4.0029 6.7796 6.6210 11.1747 1.7961 5.2877 23.7108
temp: 298.150 k
press: 1.00000 atm
elementType: 8 8 8 7 6 6 6 6 6 6 6 6 6 6 6 6 6 6 6 6 6 6 6 6 6 6 6 1 1 1 1 1 1 1 1 1 1 1 1 1 1 1 1 1 1 1 1 1 1 1 1 1
symmnumber: 1
zpe: 1118295.5 jmol-1
zpe.correction: 0.425936 hartree
zpe.thermalcorrener: 0.450546 hartree
zpe.thermalcorrenthalpy: 0.451490 hartree
zpe.thermalcorrgfe: 0.369812 hartree
zpe.sumelectzpe: -1169.889754 hartree
zpe.sumelectthermal: -1169.865145 hartree
zpe.sumelectthermalent: -1169.864201 hartree
zpe.sumelectthermalfe: -1169.945878 hartree
dipole: -2.3578 3.8766 1.8014
dipole: 4.8818
quadrupole: -135.2936 -158.3668 -161.3041
quadrupole: 12.7833 -4.3388 4.3276
quadrupole: 16.3612 -6.7119 -9.6493 12.7833 -4.3388 4.3276
hfenergy: -1170.3156906 hartree
pointgroup: C01 [X(C23H25N1O3)]
dipole: -0.996007 -1.4198256 -0.8252402 debye
polarizability: 392.9016006|20.9187286|303.1354003|-4.3235069|12.8871109|156.9070367 unknown
InChI: InChI=1S/C23H25NO3/c1-16-22(25)19-8-4-5-9-21(19)27-23(16)17-10-11-20(26-2)18(14-17)15-24-12-6-3-7-13-24/h4-5,8-11,14H,3,6-7,12-13,15H2,1-2H3
charge 0 multiplicity 1
52 atoms
O  -3.396708 -3.359992 0.255775
O  2.505989 -1.125649 -0.257523
O  3.184591 2.920885 0.453721
N  -3.626746 0.88589 -0.351412
C  -3.799062 1.134618 1.105326
C  -4.638438 1.619336 -1.154754
C  -3.68321 2.637026 1.428819
C  -4.548055 3.138007 -0.899802
C  -4.70481 3.453377 0.605183
C  -3.589438 -0.560918 -0.670283
C  -2.274547 -1.217143 -0.256014
C  -1.072292 -0.475618 -0.279545
C  -2.2172 -2.576007 0.154166
C  0.168406 -1.046514 0.104968
C  -0.990915 -3.164811 0.540209
C  1.42876 -0.269503 0.07217
C  0.19552 -2.411388 0.510936
C  1.623627 1.08006 0.335096
C  4.077145 0.756843 -0.138951
C  2.974892 1.679491 0.22761
C  3.807909 -0.61612 -0.356442
C  0.521301 2.015506 0.782279
C  -3.876135 -3.927992 -1.017401
C  5.418086 1.208729 -0.265413
C  4.824453 -1.536813 -0.694686
C  6.443859 0.30974 -0.600182
C  6.144104 -1.065224 -0.814911
H  -3.026263 0.562625 1.650318
H  -4.796969 0.757558 1.453894
H  -5.678582 1.271188 -0.914318
H  -4.45736 1.402127 -2.224825
H  -2.656776 2.977827 1.190511
H  -3.842401 2.79159 2.513185
H  -5.327135 3.656231 -1.491325
H  -3.562564 3.499658 -1.252192
H  -5.732779 3.190494 0.931282
H  -4.575418 4.536609 0.788559
H  -3.713591 -0.656348 -1.768723
H  -4.434376 -1.122752 -0.201715
H  -1.143515 0.563751 -0.609782
H  -0.991868 -4.208236 0.871314
H  1.145309 -2.867199 0.804026
H  0.018318 2.498128 -0.0773
H  0.976724 2.827684 1.373557
H  -0.247376 1.500261 1.381435
H  5.610008 2.272213 -0.089839
H  -4.133597 -3.134793 -1.746397
H  -4.77817 -4.505545 -0.764073
H  -3.112187 -4.596326 -1.460185
H  4.5671 -2.587267 -0.858365
H  7.475749 0.662643 -0.696769
H  6.945336 -1.764439 -1.077315
