program: Gaussian 09
title: 000049633
version: EM64L-G09RevD.01
frameworkgroup: C1[X(C23H27NO2)]
method: RPBEPBE
basis: SDD
operation: Freq
keyword: #p
keyword: freq=noraman
keyword: PBEPBE/SDD
title: #p freq=noraman PBEPBE/SDD
converged: NO YES NO NO
title: Mulliken charges:
elementType: O O N C C C C C C C C C C C C C C C C C C C C C C C H H H H H H H H H H H H H H H H H H H H H H H H H H H
charge: -0.284416 -0.215096 -0.101020 0.047011 -0.449558 -0.505457 -0.428130 -0.383965 -0.368888 0.014255 -0.643733 -0.542029 -0.727799 0.292030 0.288613 0.269704 0.169751 0.166354 -0.415457 -0.423323 -0.396491 -0.396072 -0.237892 -0.235246 -0.234003 -0.237088 0.189446 0.215557 0.210685 0.219038 0.214755 0.188241 0.218629 0.208459 0.169988 0.204692 0.190351 0.253600 0.218057 0.236735 0.190543 0.283067 0.217871 0.253646 0.217274 0.242943 0.250070 0.239486 0.241219 0.226296 0.224837 0.226191 0.226268
chargesum: 0.00000
title: Mulliken charges with hydrogens summed into heavy atoms:
elementType: O O N C C C C C C C C C C C C C C C C C C C C C C C
charge: -0.284416 -0.215096 -0.101020 0.236457 -0.023316 -0.071664 -0.021260 -0.005518 0.026155 0.267855 0.001603 -0.258962 -0.039009 0.292030 0.288613 0.269704 0.169751 0.166354 -0.172514 -0.173253 -0.157005 -0.154853 -0.011596 -0.010408 -0.007813 -0.010820
polarizability: 3.31054230e+02 2.33083332e+01 2.92767875e+02 1.32055466e+01 -1.06718223e+01 1.61092200e+02
1716.lowfreq: -18.4459 -3.4816 -0.0006 -0.0005 -0.0003 5.3292 10.8769 23.0479 32.3077
frequency: -2.5248 22.7138 32.0365 37.6267 50.1897 68.8951 93.8961 98.1627 119.9135 140.0407 145.1000 157.4503 182.6661 189.8225 217.5738 220.0002 238.4787 261.6635 281.2893 288.4939 292.5314 323.3478 335.8958 407.7568 410.1174 420.1422 422.5426 440.6116 446.3554 460.4409 472.7751 485.3094 501.2553 508.8491 543.5745 561.1206 568.3256 617.8050 643.1552 680.5397 697.9304 727.5569 734.3498 747.5454 750.0091 762.4289 776.3118 791.9254 818.9371 825.9253 849.5793 857.1343 878.1215 882.6411 887.4323 891.4717 928.1872 935.8540 943.9493 950.8695 954.7294 971.9667 985.0861 987.2019 996.0431 1011.7078 1021.6316 1027.8620 1030.3957 1046.2490 1074.4429 1079.3506 1089.7422 1095.0140 1105.7654 1109.4732 1113.0868 1123.8955 1136.1547 1150.7819 1161.2304 1163.3580 1169.1413 1173.1752 1181.4262 1192.6721 1207.5199 1228.2844 1244.9052 1251.4806 1260.2393 1266.2899 1273.2521 1293.3056 1297.7863 1305.8951 1309.4834 1326.2202 1334.1729 1339.9184 1345.9370 1357.6163 1363.2603 1377.3203 1377.5913 1385.2074 1403.2826 1433.5511 1438.8158 1444.5416 1448.9962 1450.7829 1459.2177 1463.9590 1467.1717 1467.9961 1471.0176 1477.8999 1480.6141 1483.7850 1486.4756 1592.3435 1593.7112 1615.8937 1621.3078 1641.1553 2810.0949 2821.7194 2858.5507 2962.3442 2977.0213 2985.3517 2985.5701 2989.7817 3010.6864 3021.1897 3031.9134 3032.4296 3034.4022 3044.1113 3052.4059 3054.8516 3085.3632 3088.5226 3103.5223 3123.0791 3124.0033 3131.0330 3132.4852 3143.2805 3144.6438 3160.8791 3162.6997
redmass: 4.4280 5.3649 3.5070 5.3524 4.2801 3.6302 4.2326 4.6746 3.4389 3.5274 3.8232 3.0750 3.0454 3.3429 1.6871 1.1138 2.5089 2.2919 5.5524 4.1310 2.2105 1.8606 3.3984 3.5151 3.6325 3.2236 3.2087 2.6660 2.9714 3.1978 3.7651 3.5841 3.8066 2.7893 5.8172 1.9273 3.3411 6.9817 5.8112 5.1780 4.6386 3.6381 4.4415 1.7402 1.6163 2.7577 4.4324 2.1741 1.5777 2.0041 2.8574 2.2016 2.2481 1.5724 1.7441 2.1007 2.2854 2.3973 1.9178 1.4426 1.6082 2.1253 1.3338 1.3261 6.4376 1.6445 2.2299 1.8583 2.0269 2.0916 2.0792 2.8820 2.6480 2.0329 1.5668 1.6586 1.5751 1.7119 2.0808 1.5868 2.2744 1.2818 1.1907 1.1340 1.8970 2.0332 1.9761 1.4243 1.8710 1.9132 1.8196 1.2316 1.3382 1.4138 1.5319 1.9146 1.3123 1.2486 1.2454 1.4202 1.4816 1.5521 1.4424 1.7244 4.3634 1.2323 3.7692 1.1620 2.2378 2.7864 1.0854 1.0909 1.0881 1.0703 1.1484 2.3018 1.0859 1.0661 1.0462 3.9583 1.0495 6.7956 6.8668 7.3681 7.3041 9.8868 1.0758 1.0738 1.0575 1.0639 1.0611 1.0549 1.0614 1.0407 1.0824 1.0874 1.0886 1.0839 1.0847 1.1004 1.1029 1.0983 1.0986 1.0992 1.1003 1.0851 1.0853 1.0895 1.0896 1.0949 1.0949 1.1003 1.1003
irintensity: 0.0061 0.1727 0.0337 0.5256 0.4343 0.0698 1.5714 1.8507 0.6598 0.1880 1.3399 2.0989 3.0513 1.4010 0.2222 0.3380 1.0161 0.6016 1.6433 2.0837 4.0353 2.0087 2.7453 0.3830 0.5678 4.0787 4.5854 0.6051 0.3756 3.7743 7.8855 7.4719 1.1754 1.8428 1.8261 0.9001 0.1379 8.4327 2.1130 8.6467 11.8865 6.3780 3.1494 23.2590 111.5405 20.4981 11.5787 0.1337 0.9710 2.3806 6.0728 0.8244 3.3389 6.7250 0.2016 2.7903 13.3643 39.3722 14.0602 0.2108 8.0358 3.6309 0.0492 0.1175 2.6771 60.2884 0.5498 31.5331 7.5923 8.6604 34.4105 292.7196 96.8704 54.9552 12.7810 0.9747 9.2082 2.2070 3.3822 5.6838 11.3297 0.3640 2.7889 0.9485 13.8468 22.6750 9.7112 3.0154 6.9024 9.7704 104.3389 1.5140 10.4141 2.0894 11.6569 11.2823 0.4564 6.7039 8.0044 0.0833 0.7150 14.8860 4.2643 8.9736 13.6532 20.6313 2.1883 2.9605 22.3805 18.1097 7.0635 6.3247 13.5689 15.5645 5.6979 7.4188 2.1917 9.8435 13.5682 2.1631 22.6127 1.8121 0.6814 5.2846 11.8646 123.0664 48.0347 134.1918 143.5128 44.4529 25.6248 6.1067 33.2264 37.3319 1.3589 60.3625 4.0842 61.9681 58.9332 29.9055 78.5302 31.7554 34.7844 40.0606 18.3949 1.1558 1.6615 7.0677 1.5239 7.9031 44.5932 43.3565 27.0874
temp: 298.150 k
press: 1.00000 atm
elementType: 8 8 7 6 6 6 6 6 6 6 6 6 6 6 6 6 6 6 6 6 6 6 6 6 6 6 1 1 1 1 1 1 1 1 1 1 1 1 1 1 1 1 1 1 1 1 1 1 1 1 1 1 1
symmnumber: 1
zpe: 1168382.8 jmol-1
zpe.correction: 0.445014 hartree
zpe.thermalcorrener: 0.467861 hartree
zpe.thermalcorrenthalpy: 0.468805 hartree
zpe.thermalcorrgfe: 0.392469 hartree
zpe.sumelectzpe: -1095.952269 hartree
zpe.sumelectthermal: -1095.929422 hartree
zpe.sumelectthermalent: -1095.928478 hartree
zpe.sumelectthermalfe: -1096.004814 hartree
dipole: 1.1349 0.2109 1.6571
dipole: 2.0195
quadrupole: -142.7192 -140.0296 -161.9369
quadrupole: -1.1685 0.4070 -4.6208
quadrupole: 5.5094 8.1990 -13.7083 -1.1685 0.4070 -4.6208
hfenergy: -1096.3972829 hartree
pointgroup: C01 [X(C23H27N1O2)]
dipole: 0.4215874 -0.1717437 -0.6511973 debye
polarizability: 328.3538074|-26.8496619|290.6530904|-16.2092614|-23.8299758|165.9074075 unknown
InChI: InChI=1S/C23H27NO2/c1-16(15-17-9-7-8-14-24(17)2)26-23(25)22-20-12-5-3-10-18(20)19-11-4-6-13-21(19)22/h3-6,10-13,16-17,22H,7-9,14-15H2,1-2H3
charge 0 multiplicity 1
53 atoms
O  0.733909 1.543198 -0.399562
O  -0.716527 1.82437 1.411978
N  4.844592 0.105196 -0.776776
C  3.468254 0.357417 -0.236428
C  3.368159 -0.179211 1.214193
C  3.14215 1.871956 -0.307578
C  3.769683 -1.66527 1.321365
C  5.203928 -1.338638 -0.72433
C  5.169442 -1.881569 0.71444
C  1.817358 2.306764 0.332425
C  5.050088 0.629278 -2.146784
C  -1.427968 0.533443 -0.596873
C  1.545855 3.809461 0.182862
C  -2.908545 0.854829 -0.407071
C  -1.359489 -0.954514 -0.214441
C  -0.48314 1.374137 0.270253
C  -3.616393 -0.309186 0.014268
C  -2.658479 -1.424532 0.140485
C  -3.579033 2.072147 -0.605067
C  -0.245667 -1.808676 -0.186025
C  -5.010001 -0.256641 0.234715
C  -2.844644 -2.770667 0.523817
C  -4.978082 2.125152 -0.383196
C  -0.43534 -3.159358 0.201532
C  -5.685486 0.969345 0.032074
C  -1.723749 -3.633529 0.552858
H  2.712002 -0.188573 -0.86368
H  2.332956 -0.052307 1.581573
H  4.032013 0.431457 1.85877
H  3.120485 2.206131 -1.361179
H  3.960606 2.424431 0.196378
H  3.031797 -2.287962 0.772658
H  3.740495 -1.992952 2.377717
H  6.219921 -1.450672 -1.147337
H  4.510167 -1.951011 -1.362272
H  5.926969 -1.345539 1.318098
H  5.437934 -2.955668 0.711453
H  1.749446 2.020188 1.396912
H  6.055047 0.331444 -2.495169
H  5.011102 1.730447 -2.160881
H  4.301704 0.242364 -2.884866
H  -1.112947 0.671729 -1.648697
H  1.539337 4.101343 -0.882619
H  0.578507 4.079134 0.638034
H  2.337562 4.386534 0.694967
H  -3.036171 2.971053 -0.918383
H  0.750038 -1.440353 -0.457452
H  -5.563354 -1.145307 0.558426
H  -3.837339 -3.145282 0.797196
H  -5.517856 3.067058 -0.531088
H  0.420756 -3.842886 0.230879
H  -6.76681 1.029043 0.199441
H  -1.851343 -4.680144 0.851388
