program: Gaussian 09
title: 000049613
version: EM64L-G09RevD.01
frameworkgroup: C1[X(C17H27NO2)]
method: RPBEPBE
basis: SDD
operation: Freq
keyword: #p
keyword: freq=noraman
keyword: PBEPBE/SDD
title: #p freq=noraman PBEPBE/SDD
converged: YES YES NO NO
title: Mulliken charges:
elementType: O O N C C C C C C C C C C C C C C C C C H H H H H H H H H H H H H H H H H H H H H H H H H H H
charge: -0.288009 -0.260591 -0.081481 -0.365944 -0.181384 -0.382900 -0.346160 -0.381789 -0.517758 0.463199 -0.356579 0.287909 -0.695795 -0.435647 -0.387002 -0.635324 -0.612994 -0.224520 -0.226180 -0.240258 0.261306 0.183668 0.245271 0.199964 0.215597 0.180956 0.182478 0.233766 0.202292 0.229117 0.227232 0.197033 0.191847 0.208231 0.209653 0.214566 0.235915 0.258532 0.266740 0.218995 0.186580 0.193777 0.219611 0.225306 0.226607 0.225500 0.228668
chargesum: 0.00000
title: Mulliken charges with hydrogens summed into heavy atoms:
elementType: O O N C C C C C C C C C C C C C C C C C
charge: -0.288009 -0.260591 -0.081481 0.062996 0.079922 0.032661 0.017274 0.054270 -0.061409 0.463199 0.032300 0.287909 -0.063345 -0.199732 -0.128470 0.036991 0.025700 0.002087 -0.000680 -0.011591
polarizability: 2.44434380e+02 -1.82106941e+00 1.69751315e+02 8.20023913e+00 1.58698985e+01 1.71134346e+02
1716.lowfreq: -25.9722 -9.8173 -4.6915 -0.0005 0.0003 0.0004 2.7857 18.5221 25.5103
frequency: -16.8838 17.7261 25.2421 37.4414 48.9258 68.1125 69.8574 79.5927 83.1532 98.9941 124.9115 131.0803 138.9374 191.8982 204.1655 232.0009 232.7446 238.4504 251.6116 258.8397 287.4894 308.4868 334.6590 364.8951 374.1833 401.8319 422.8854 439.5915 461.9509 507.0452 546.5593 570.0285 614.7262 623.4435 662.3532 704.9717 725.5959 758.1433 759.4163 796.4155 808.9863 829.6772 852.3501 856.1823 873.1266 887.6356 904.6626 922.3409 956.8541 978.5454 988.3312 990.2863 996.7662 1003.7489 1018.4620 1024.8982 1029.0158 1039.3192 1047.4452 1068.5979 1070.2977 1082.9751 1094.5398 1096.4009 1112.4065 1139.6229 1171.7050 1172.8961 1179.5350 1186.9929 1203.0331 1212.4402 1215.7760 1255.1626 1258.9500 1261.6727 1280.8340 1281.8802 1290.0059 1297.2927 1313.3733 1316.1541 1323.3934 1338.4098 1344.9009 1362.6354 1367.6764 1386.1614 1388.8054 1421.9372 1437.4568 1440.6983 1450.2694 1455.8789 1459.7962 1461.7835 1466.7348 1469.9752 1470.9970 1477.0305 1480.7655 1483.8975 1484.7466 1487.3913 1489.4084 1594.1320 1615.6768 1637.4869 2840.5676 2856.5592 2870.5398 2946.7023 2955.1457 2965.6537 2970.7244 2979.2235 2986.2523 3006.2691 3007.7807 3016.7792 3023.1357 3025.7974 3036.3176 3041.7087 3047.4094 3066.8972 3069.5028 3076.0289 3083.2867 3090.6785 3117.9511 3127.0216 3140.5226 3154.0580 3165.8615
redmass: 4.0842 3.6148 2.8770 2.6359 2.9345 3.5952 3.3897 3.6953 3.3690 3.6629 2.2833 2.4062 2.8941 3.1780 2.6009 1.7910 1.1099 1.7417 1.6568 2.6502 2.8054 2.9543 3.4896 3.0370 2.2704 2.8281 2.7098 2.4868 3.1750 3.5421 3.0971 4.8950 6.1793 5.7365 2.6320 1.8177 1.0765 1.2909 1.8103 3.4942 3.7568 1.6342 2.7063 1.2695 2.2742 1.7813 2.6670 1.4497 1.4670 1.3851 2.8896 6.0646 1.3386 1.9984 3.2967 2.2754 2.0802 1.6844 2.0967 2.3211 2.3446 1.5859 1.9071 1.3989 2.1932 1.4318 1.7972 1.1275 1.9140 1.1256 1.4583 2.1266 1.8848 1.3263 1.3080 2.2517 1.4713 1.0801 1.7310 1.1829 1.2164 1.2709 1.3316 1.3663 1.5467 1.5156 1.4146 5.9577 1.2196 1.1442 1.2263 1.8144 1.0889 1.0912 1.0991 1.0811 1.0702 1.0682 1.0649 1.0431 1.0711 1.1852 1.8702 1.0816 1.0551 6.1719 6.1165 9.8564 1.0689 1.0561 1.0566 1.0588 1.0594 1.0587 1.0366 1.0631 1.0959 1.0645 1.0972 1.0739 1.0850 1.1028 1.0746 1.0870 1.1036 1.1006 1.0992 1.1009 1.1006 1.1008 1.0867 1.0869 1.0923 1.0955 1.1009
irintensity: 0.0104 0.2910 0.0558 0.1637 0.0732 0.5205 0.5808 1.0806 0.4140 2.1615 0.2343 0.2468 2.1801 0.3254 0.6629 2.3157 0.0126 0.1355 1.7476 1.5445 0.1923 12.8802 1.7142 2.3025 5.7534 0.7632 1.9227 4.2040 0.2774 5.2572 35.5147 5.0303 2.2819 10.3160 6.4987 53.1465 12.9187 2.7521 32.6532 5.8553 15.4476 3.9976 9.0858 0.1435 18.2331 4.7618 21.6076 6.6464 29.6248 0.0839 85.6510 0.1693 1.6369 9.6805 21.5996 17.5675 3.5579 23.8982 86.5262 36.7842 0.4577 10.5587 57.1435 6.4713 8.5885 4.9012 56.7488 6.7722 10.2165 2.6618 2.5185 77.6347 55.3024 20.1124 13.5347 11.7389 4.5078 0.1366 0.2969 1.0431 6.1686 3.6388 4.4344 1.1322 2.6530 0.3601 3.3462 0.6379 12.3621 4.1938 5.9847 3.8769 15.1875 9.2696 0.8977 15.0593 4.4898 1.8146 13.0451 11.9800 3.2792 11.4578 8.5970 15.9993 37.7952 6.8544 6.7541 170.5924 84.6127 63.4424 246.3220 10.0169 11.2433 62.4914 37.0405 60.9694 3.0145 20.2573 5.2822 53.7797 9.5090 21.8923 22.1041 19.1233 52.0817 94.2574 48.8351 31.6999 33.5506 26.2618 6.7388 0.6237 24.7689 29.9165 17.8762
temp: 298.150 k
press: 1.00000 atm
elementType: 8 8 7 6 6 6 6 6 6 6 6 6 6 6 6 6 6 6 6 6 1 1 1 1 1 1 1 1 1 1 1 1 1 1 1 1 1 1 1 1 1 1 1 1 1 1 1
symmnumber: 1
zpe: 1066087.8 jmol-1
zpe.correction: 0.406051 hartree
zpe.thermalcorrener: 0.427864 hartree
zpe.thermalcorrenthalpy: 0.428808 hartree
zpe.thermalcorrgfe: 0.352953 hartree
zpe.sumelectzpe: -867.633197 hartree
zpe.sumelectthermal: -867.611385 hartree
zpe.sumelectthermalent: -867.610441 hartree
zpe.sumelectthermalfe: -867.686295 hartree
dipole: -0.3480 1.0262 -2.0393
dipole: 2.3093
quadrupole: -114.3098 -116.2561 -127.8942
quadrupole: -2.8215 1.0343 5.1776
quadrupole: 5.1769 3.2306 -8.4075 -2.8215 1.0343 5.1776
hfenergy: -868.0392488 hartree
pointgroup: C01[X(C17H27N1O2)]
dipole: -0.1377282 0.5185438 -0.7332029 debye
polarizability: 244.4170297|-2.5794282|165.0444446|7.9690754|14.9926551|175.8585669 unknown
InChI: InChI=1S/C17H27NO2/c1-4-5-6-10-13-17(19)20-16(14-18(2)3)15-11-8-7-9-12-15/h7-9,11-12,16H,4-6,10,13-14H2,1-3H3
charge 0 multiplicity 1
47 atoms
O  -0.442165 -0.891677 0.150886
O  0.269976 -1.179901 2.359759
N  0.730092 1.809472 0.634991
C  3.212151 -1.027373 0.132626
C  -1.284445 0.272344 0.552158
C  2.232602 -2.058753 -0.47024
C  4.271906 -0.547177 -0.884407
C  -0.594698 1.560354 0.036561
C  1.19781 -2.597177 0.555686
C  -2.666191 0.104853 -0.058434
C  5.247933 0.497973 -0.296908
C  0.327846 -1.503134 1.150675
C  6.306513 0.976277 -1.314118
C  -3.800356 0.599042 0.631799
C  -2.837227 -0.485158 -1.33557
C  0.67043 2.184096 2.064386
C  1.526783 2.763653 -0.164306
C  -5.086999 0.512106 0.05394
C  -4.123709 -0.578633 -1.911143
C  -5.252056 -0.076531 -1.221031
H  -1.344339 0.277859 1.655744
H  3.721549 -1.471737 1.013312
H  2.633918 -0.155589 0.501055
H  2.79832 -2.923229 -0.872483
H  1.690042 -1.602134 -1.319949
H  4.852428 -1.41703 -1.258927
H  3.760701 -0.111031 -1.768742
H  -0.47419 1.460866 -1.058499
H  -1.308142 2.408179 0.211888
H  0.538286 -3.333257 0.057902
H  1.708811 -3.099381 1.394927
H  5.753581 0.065112 0.590323
H  4.666035 1.367551 0.072391
H  5.827331 1.441222 -2.196647
H  6.919401 0.128677 -1.675236
H  6.990904 1.721938 -0.868855
H  -3.679184 1.043816 1.627514
H  -1.964016 -0.888505 -1.858646
H  0.247877 1.356265 2.657652
H  1.694708 2.362712 2.435966
H  0.066766 3.109511 2.245772
H  1.084366 3.791115 -0.203621
H  2.541203 2.84856 0.265559
H  1.624982 2.39262 -1.200237
H  -5.957407 0.894248 0.599028
H  -4.247613 -1.044079 -2.895589
H  -6.249616 -0.149734 -1.668612
