program: Gaussian 09
title: 000049612
version: EM64L-G09RevD.01
frameworkgroup: C1[X(C12H19N3O)]
method: RPBEPBE
basis: SDD
operation: Freq
keyword: #p
keyword: freq=noraman
keyword: PBEPBE/SDD
title: #p freq=noraman PBEPBE/SDD
converged: YES YES NO NO
title: Mulliken charges:
elementType: O N N N C C C C C C C C C C C C H H H H H H H H H H H H H H H H H H H
charge: -0.305802 -0.137763 -0.633702 -0.657165 -0.405340 0.044305 -0.278899 0.325787 0.352351 -0.434118 -0.388397 -0.421100 -0.237341 -0.818549 -0.819892 0.221895 0.201401 0.200461 0.237097 0.198949 0.231782 0.187811 0.228512 0.229467 0.219727 0.252858 0.222060 0.224387 0.207051 0.228048 0.270264 0.317363 0.292681 0.309778 0.334034
chargesum: 0.00000
title: Mulliken charges with hydrogens summed into heavy atoms:
elementType: O N N N C C C C C C C C C C C C
charge: -0.305802 -0.137763 -0.023659 -0.013353 -0.003478 0.044305 0.157146 0.325787 0.352351 -0.014525 -0.159884 -0.191633 -0.017613 -0.119244 -0.114528 0.221895
polarizability: 2.00749123e+02 -9.92915802e+00 1.64522201e+02 -1.16480569e+01 -2.16784646e+00 1.04644527e+02
1716.lowfreq: -13.9968 -9.9272 0.0005 0.0008 0.0009 2.9144 18.8482 21.5212 39.6463
frequency: 18.6743 21.2407 39.5868 61.9546 81.3951 119.2522 128.1521 148.3782 156.1496 175.1878 219.0551 229.8612 252.9178 273.0918 301.9322 328.7582 347.5029 377.1579 397.2001 424.7551 446.2664 466.7686 482.4465 511.6982 527.5126 539.3270 545.9935 560.4240 564.2019 660.3006 674.3955 744.7078 763.4505 776.7975 810.2814 872.4313 888.8164 895.1512 916.9894 926.5922 968.6837 981.1085 982.2959 1031.7955 1035.3245 1040.5508 1045.5605 1049.7619 1069.0762 1088.3689 1113.5821 1165.6475 1173.0710 1175.1866 1193.4216 1207.8604 1255.0606 1271.0043 1282.3915 1341.5545 1356.2351 1366.6820 1371.6121 1390.3500 1404.5193 1408.1274 1429.2092 1439.6520 1451.7268 1458.0453 1463.2353 1465.6080 1479.9514 1487.5375 1489.3483 1597.1654 1599.8574 1601.4634 1613.0019 1670.5810 2885.1088 2963.5882 2965.6337 2970.1895 2973.3524 2997.9948 3038.5812 3048.5002 3054.6060 3059.1514 3079.2899 3093.2224 3113.5300 3122.7815 3151.2144 3522.2079 3549.3536 3670.7401 3695.5038
redmass: 3.8791 4.4138 4.0720 4.4097 3.5827 1.0330 3.6961 3.1858 1.1660 2.4626 2.9420 2.6761 2.6545 2.5960 3.9953 2.9417 2.1300 1.3208 1.2996 1.2185 1.6814 3.3352 2.7628 3.0699 3.5863 5.3959 2.5986 1.7156 2.4355 4.0694 5.3734 3.3956 2.5772 1.2224 3.3678 3.7259 2.6767 1.3112 2.6009 3.0682 1.3292 2.1442 1.7600 1.4397 1.7728 1.7521 1.6031 1.5935 1.9408 1.7495 2.4393 4.1007 1.1565 1.8059 1.1457 1.2904 1.6040 3.2431 1.1413 1.3829 1.4000 6.9347 1.4654 1.2564 1.2636 3.9745 2.2063 1.0952 1.6618 1.2030 1.1192 1.0749 1.1670 1.1279 1.1830 5.5348 1.2256 7.3642 1.2795 3.6972 1.0642 1.0772 1.0726 1.0371 1.0405 1.0621 1.1032 1.0974 1.0930 1.1023 1.0996 1.0998 1.0855 1.0918 1.0991 1.0450 1.0453 1.1017 1.1030
irintensity: 0.5626 2.9794 3.3574 0.8681 0.7928 0.2392 2.8581 0.7219 1.0891 6.2924 4.0394 5.7193 15.7123 6.0825 7.1934 8.0428 29.7298 56.2714 169.1590 155.6909 6.4673 0.1367 8.3365 0.2042 1.6055 1.8160 76.8892 154.6428 48.2015 1.0862 85.3583 0.6825 9.1166 56.5569 3.3705 11.6146 24.7196 0.0219 3.9825 55.1966 0.5640 29.6772 0.7317 12.5699 2.0547 34.9230 0.9649 2.9408 1.4378 52.6376 6.6245 132.4238 0.6017 2.8073 7.6897 1.2344 0.5862 17.2697 2.4234 22.1250 6.8693 1.0019 12.6550 15.0974 9.4385 119.1893 21.6530 11.8964 23.1197 26.7217 15.0712 13.9865 5.9794 60.9420 17.6354 3.8891 143.5793 4.0449 74.6900 573.7607 87.2290 40.1003 27.5147 18.8572 37.8251 55.0480 30.5109 15.3837 28.8845 44.1720 20.8629 13.0331 0.6893 30.6889 38.9457 18.5617 20.5956 18.8027 19.5726
temp: 298.150 k
press: 1.00000 atm
elementType: 8 7 7 7 6 6 6 6 6 6 6 6 6 6 6 6 1 1 1 1 1 1 1 1 1 1 1 1 1 1 1 1 1 1 1
symmnumber: 1
zpe: 775458.4 jmol-1
zpe.correction: 0.295357 hartree
zpe.thermalcorrener: 0.313173 hartree
zpe.thermalcorrenthalpy: 0.314117 hartree
zpe.thermalcorrgfe: 0.248037 hartree
zpe.sumelectzpe: -706.918865 hartree
zpe.sumelectthermal: -706.901048 hartree
zpe.sumelectthermalent: -706.900104 hartree
zpe.sumelectthermalfe: -706.966184 hartree
dipole: 3.7012 -0.8113 -0.1244
dipole: 3.7911
quadrupole: -74.8029 -88.3967 -96.3842
quadrupole: -8.0737 -8.2149 -1.5904
quadrupole: 11.7250 -1.8687 -9.8563 -8.0737 -8.2149 -1.5904
hfenergy: -707.214221 hartree
pointgroup: C01 [X(C12H19N3O1)]
dipole: 1.4365974 -0.3967746 -0.0585374 debye
polarizability: 199.5880588|-11.504257|165.7521522|-11.9612827|0.2211785|104.5756398 unknown
InChI: InChI=1S/C12H19N3O/c1-9-5-3-6-10(2)11(9)16-8-4-7-15-12(13)14/h3,5-6H,4,7-8,13-14H2,1-2H3
charge 0 multiplicity 1
35 atoms
O  -0.543757 1.052913 -0.537569
N  2.835943 0.088014 0.443772
N  4.377502 -1.502218 1.234148
N  4.712844 -0.636847 -0.921553
C  1.512525 2.151183 0.159006
C  -1.654843 0.212662 -0.245547
C  0.226798 1.49437 0.659655
C  -2.910535 0.797116 0.0739
C  -1.477817 -1.195417 -0.351662
C  2.462327 1.142257 -0.52235
C  -4.009798 -0.069553 0.300313
C  -2.600245 -2.025341 -0.111123
C  -3.858087 -1.470343 0.216549
C  -3.071421 2.304338 0.154158
C  -0.130901 -1.776107 -0.738796
C  3.911837 -0.633336 0.232605
H  1.255585 2.961035 -0.551132
H  2.030507 2.605307 1.025706
H  0.470988 0.616437 1.287297
H  -0.388007 2.208826 1.24444
H  1.926729 0.707621 -1.394085
H  3.347871 1.697725 -0.915671
H  -4.989116 0.363668 0.538688
H  -2.484324 -3.113398 -0.187083
H  -4.717054 -2.126985 0.39557
H  -2.354778 2.808884 -0.515982
H  -4.095716 2.607707 -0.124916
H  -2.886713 2.67804 1.180675
H  -0.149633 -2.878788 -0.686158
H  0.136859 -1.484251 -1.772034
H  0.684895 -1.404403 -0.091128
H  3.849085 -1.468488 2.104729
H  4.78605 -2.39688 0.966257
H  5.690843 -0.912847 -0.869193
H  4.400159 -0.129602 -1.744186
