program: Gaussian 09
title: 000049557
version: EM64L-G09RevD.01
frameworkgroup: C1[X(C24H29N)]
method: RPBEPBE
basis: SDD
operation: Freq
keyword: #pfreq=noraman
keyword: PBEPBE/SDD
title: #p freq=noraman PBEPBE/SDD
converged: NO YES NO NO
title: Mulliken charges:
elementType: N C C C C C C C C C C C C C C C C C C C C C C C C H H H H H H H H H H H H H H H H H H H H H H H H H H H H H
charge: -0.095039 -0.066504 -0.403734 -0.362764 -0.414987 -0.391306 -0.349749 -0.740800 -0.469736 -0.328613 0.151938 0.165031 0.183780 -0.547959 -0.622148 0.287158 0.340815 -0.403279 -0.391195 -0.366977 -0.442081 -0.256417 -0.258297 -0.256311 -0.237052 0.212785 0.208500 0.186453 0.177257 0.201200 0.211059 0.195290 0.189062 0.204174 0.176268 0.213904 0.216762 0.218940 0.228585 0.194337 0.254818 0.232880 0.219043 0.237220 0.210652 0.224244 0.250235 0.243179 0.230151 0.235276 0.226339 0.226758 0.226624 0.224232
chargesum: 0.00000
title: Mulliken charges with hydrogens summed into heavy atoms:
elementType: N C C C C C C C C C C C C C C C C C C C C C C C C
charge: -0.095039 0.146282 -0.008781 0.015692 -0.008637 0.001930 0.040423 -0.076513 -0.020581 -0.095733 0.151938 0.165031 0.183780 -0.091696 -0.187253 0.287158 0.340815 -0.153044 -0.148016 -0.136827 -0.206805 -0.030078 -0.031539 -0.029687 -0.012821
polarizability: 3.00671209e+02 -2.07414707e+01 2.71400743e+02 2.66624519e+01 1.19844298e+01 2.22610124e+02
1716.lowfreq: -5.7395 -5.1087 -0.0007 -0.0005 -0.0002 7.1936 18.0197 23.6841 29.7046
frequency: 17.3335 23.6109 29.4556 42.9527 70.3542 81.8770 98.6227 126.5405 144.8238 145.9114 161.3024 175.3549 187.6540 194.8759 222.1984 254.2627 271.8355 302.1950 314.4979 321.2387 341.5661 362.8378 376.3249 398.6957 423.6108 438.6322 446.6688 457.8906 474.4403 496.5205 510.4471 531.2273 537.7897 582.4570 590.6980 619.1485 629.7001 658.4022 680.0482 719.4879 729.2295 742.6078 762.3422 769.1311 772.4704 775.1960 798.9402 807.6206 822.8370 854.5035 864.1186 871.7465 879.7302 883.4259 892.9892 918.5845 920.1856 946.9126 951.7799 971.4146 972.9362 983.5195 986.2761 992.7735 1008.6786 1023.8983 1031.6228 1036.4454 1039.0411 1056.6990 1070.8307 1080.7945 1089.9293 1106.4119 1108.1793 1115.9179 1148.7608 1154.2044 1163.3780 1165.5581 1172.8329 1173.7244 1176.8057 1183.4297 1194.2233 1217.8919 1223.5529 1238.1509 1256.8164 1259.9692 1265.8820 1279.7346 1286.2484 1288.3917 1297.7391 1309.1863 1326.2462 1335.8611 1338.0810 1344.4017 1351.2684 1352.4015 1357.8655 1363.1144 1373.1239 1375.7088 1376.7703 1381.2532 1428.1904 1439.2022 1447.9300 1449.9906 1456.8660 1457.7526 1466.8491 1469.9892 1470.6551 1472.7620 1480.9204 1483.5242 1483.7013 1489.1183 1576.3175 1582.5624 1603.8074 1609.7009 1633.7946 2835.2804 2846.2820 2958.1855 2958.6269 2969.9450 2974.4181 2979.1193 2982.5799 2983.8322 2990.5601 3011.3758 3017.0451 3027.5948 3032.0774 3042.6982 3044.0530 3052.5875 3062.2316 3068.7744 3077.7248 3081.9220 3106.9516 3114.4131 3125.8428 3126.0612 3139.9184 3141.2427 3159.5160 3160.0024
redmass: 3.2342 4.3479 4.1827 4.3704 3.5138 3.8775 3.6487 3.2127 2.6428 2.8518 3.8634 1.2582 2.7010 2.0312 2.4772 3.2643 3.3247 3.1436 2.6286 2.5919 3.2361 2.6934 2.6534 2.6057 3.5125 2.6987 3.3919 2.8847 3.8152 3.3023 2.4247 4.0197 3.7346 3.3167 3.0801 2.2296 5.0611 4.4969 4.5776 3.0416 3.3613 2.0577 1.5757 1.5125 2.3343 1.9305 2.6622 1.8056 1.8845 2.3825 1.3555 1.5163 1.4517 1.5040 2.3497 2.1808 2.4450 1.4956 1.4000 2.0383 1.8107 1.3286 1.3179 1.6646 2.1784 2.5863 2.7747 2.4091 2.2478 2.2596 2.3495 1.7145 1.8134 2.1344 2.0695 2.1815 2.0379 2.3742 1.5857 1.4429 1.0682 1.1214 1.3198 1.5714 1.8704 1.6950 1.5237 1.5939 1.5984 1.2342 1.3264 1.2499 1.4257 1.4129 1.4260 1.4860 1.5372 1.4122 1.3491 1.3647 2.0226 1.4471 1.8223 1.3927 1.2794 2.7462 6.6136 1.3087 2.2478 2.2894 1.1746 1.0898 1.0877 1.0819 1.0737 1.0688 1.1318 1.0852 2.4577 1.7819 1.2859 1.0785 6.5329 6.7495 6.1227 6.4493 8.1953 1.0716 1.0701 1.0612 1.0671 1.0776 1.0608 1.0377 1.0638 1.0617 1.0667 1.0957 1.0869 1.0907 1.0922 1.1032 1.1012 1.1034 1.0903 1.0992 1.0908 1.0986 1.0876 1.0868 1.0869 1.0876 1.0939 1.0932 1.1007 1.1008
irintensity: 0.0767 0.0177 0.0609 0.0811 0.1098 0.0876 0.0544 0.2932 0.8578 0.3453 1.9762 0.3717 0.6937 0.9093 0.8254 2.8752 0.4945 2.7896 0.4708 0.6493 0.4650 2.2671 1.9300 3.8929 2.4315 6.4127 0.7407 2.3221 1.9843 7.1486 2.6472 3.7094 0.8533 0.8543 9.4484 6.3115 9.1489 0.3700 2.0266 2.3193 15.9818 18.5554 36.0384 4.3118 21.0687 68.9476 1.8344 1.6952 2.8142 8.5865 3.5252 5.0602 0.6554 4.2682 10.0709 1.1062 0.6447 0.1271 5.5224 5.4071 2.5846 0.2317 0.1077 22.0502 18.6837 10.6627 5.5991 26.9455 3.1948 2.7259 19.2153 10.1651 1.7215 13.2638 20.0434 6.4772 45.4141 31.4202 1.0265 3.4145 0.7376 1.1053 1.5931 0.8599 0.7050 1.7171 0.6830 7.6318 2.7835 7.2384 2.4020 0.2885 6.4061 3.3139 6.3253 10.5593 1.0060 4.4352 24.8443 3.1617 1.1087 4.3809 4.2444 10.7803 21.3892 10.7453 0.4064 11.4952 9.7764 1.8499 11.8109 5.4204 1.4501 11.6348 13.7343 5.4119 11.2346 3.6898 9.1254 18.8345 16.2474 2.0315 1.5863 0.7354 1.3583 1.5002 3.2440 47.3665 132.3092 30.2566 16.2508 9.9159 31.8916 32.5602 18.4283 46.7525 52.1114 42.0584 23.2710 80.4763 40.5643 18.6232 29.8303 89.0914 4.9588 46.4346 34.2709 43.8204 13.8278 8.1592 3.3293 4.2792 25.3628 30.9011 45.6420 22.5549
temp: 298.150 k
press: 1.00000 atm
elementType: 7 6 6 6 6 6 6 6 6 6 6 6 6 6 6 6 6 6 6 6 6 6 6 6 6 1 1 1 1 1 1 1 1 1 1 1 1 1 1 1 1 1 1 1 1 1 1 1 1 1 1 1 1 1
symmnumber: 1
zpe: 1222645.0 jmol-1
zpe.correction: 0.465681 hartree
zpe.thermalcorrener: 0.488280 hartree
zpe.thermalcorrenthalpy: 0.489224 hartree
zpe.thermalcorrgfe: 0.412477 hartree
zpe.sumelectzpe: -984.854455 hartree
zpe.sumelectthermal: -984.831856 hartree
zpe.sumelectthermalent: -984.830911 hartree
zpe.sumelectthermalfe: -984.907659 hartree
dipole: -0.6188 -0.3498 0.7221
dipole: 1.0133
quadrupole: -144.6589 -144.9085 -143.4490
quadrupole: 1.4999 6.2658 3.7983
quadrupole: -0.3201 -0.5697 0.8898 1.4999 6.2658 3.7983
hfenergy: -985.3201358 hartree
pointgroup: C01 [X(C24H29N1)]
dipole: -0.2400222 0.1838496 -0.2598263 debye
polarizability: 301.8843442|22.9256051|265.485548|-24.0534148|18.5793821|227.3121838 unknown
InChI: InChI=1S/C24H29N/c1-19-9-6-7-17-25(19)18-8-14-24-22-12-4-2-10-20(22)15-16-21-11-3-5-13-23(21)24/h2-5,10-14,19H,6-9,15-18H2,1H3
charge 0 multiplicity 1
54 atoms
N  -3.614644 0.496799 0.084553
C  -4.440195 0.628325 -1.154959
C  -5.754632 -0.175918 -0.974907
C  -4.309276 0.940225 1.31681
C  -6.53005 0.246246 0.294589
C  -5.612846 0.143024 1.533311
C  -2.235022 1.013627 -0.045616
C  -4.708275 2.096912 -1.602767
C  -1.223371 0.244442 0.849148
C  0.166807 0.828557 0.739522
C  1.333381 0.169683 0.446583
C  2.628002 0.935948 0.383486
C  1.372368 -1.317431 0.24956
C  3.577511 -0.235843 -1.786231
C  2.218768 -0.908226 -2.101838
C  3.639435 0.748088 -0.612253
C  1.788491 -1.858055 -1.000244
C  2.859854 1.904659 1.406581
C  0.99838 -2.196714 1.296913
C  4.816673 1.541737 -0.542723
C  1.818509 -3.262114 -1.173966
C  4.032001 2.682264 1.456254
C  1.036962 -3.597441 1.117055
C  5.025949 2.499358 0.468211
C  1.447231 -4.133813 -0.124478
H  -3.85814 0.139052 -1.962487
H  -5.491901 -1.248531 -0.893311
H  -6.385651 -0.052827 -1.876442
H  -4.543719 2.036792 1.296434
H  -3.632384 0.779483 2.176082
H  -7.423328 -0.394586 0.421927
H  -6.899806 1.28627 0.190046
H  -6.130513 0.519232 2.43713
H  -5.352019 -0.918483 1.710209
H  -2.165793 2.107814 0.18631
H  -1.9217 0.894314 -1.100677
H  -5.25023 2.107241 -2.56681
H  -5.316803 2.654058 -0.868445
H  -3.760324 2.647697 -1.74505
H  -1.565664 0.304321 1.904348
H  -1.242591 -0.822829 0.57147
H  0.221902 1.922533 0.85982
H  3.920092 0.301713 -2.693004
H  4.324514 -1.037362 -1.608017
H  2.316712 -1.458183 -3.056411
H  1.4513 -0.123941 -2.25316
H  2.106961 2.016958 2.194426
H  0.690139 -1.773917 2.259935
H  5.584685 1.400934 -1.314698
H  2.131745 -3.674489 -2.141272
H  4.174792 3.409725 2.263089
H  0.749807 -4.263145 1.938638
H  5.949077 3.089232 0.488273
H  1.476826 -5.219012 -0.274248
