program: Gaussian 09
title: 000049537
version: EM64L-G09RevD.01
frameworkgroup: C1[X(C20H24N2O)]
method: RPBEPBE
basis: SDD
operation: Freq
keyword: #p
keyword: freq=noraman
keyword: PBEPBE/SDD
title: #p freq=noraman PBEPBE/SDD
converged: NO YES NO NO
title: Mulliken charges:
elementType: O N N C C C C C C C C C C C C C C C C C C C C H H H H H H H H H H H H H H H H H H H H H H H H
charge: -0.263540 -0.049582 -0.227296 0.002228 -0.429975 -0.445413 -0.530323 -0.406395 -0.375492 0.266215 0.190340 0.176359 0.195966 -0.621599 -0.513183 -0.348440 -0.379754 -0.405980 0.323504 -0.241876 -0.378879 -0.253143 -0.536425 0.251632 0.170367 0.248280 0.167296 0.214700 0.224521 0.222502 0.213512 0.196882 0.215166 0.168912 0.225149 0.223701 0.185930 0.246730 0.236814 0.237207 0.233252 0.220274 0.247515 0.221004 0.217137 0.218403 0.245795
chargesum: 0.00000
title: Mulliken charges with hydrogens summed into heavy atoms:
elementType: O N N C C C C C C C C C C C C C C C C C C C C
charge: -0.263540 -0.049582 -0.227296 0.253860 -0.011329 -0.063417 -0.083299 0.003999 0.008586 0.266215 0.190340 0.176359 0.195966 0.013182 -0.266453 -0.111626 -0.142548 -0.172728 0.323504 -0.021602 -0.131364 -0.032139 0.144910
polarizability: 2.60339348e+02 1.56921951e+01 3.21064900e+02 -2.70652578e+01 5.17355103e+00 1.46796536e+02
1716.lowfreq: -17.0946 -5.7323 -2.6896 -0.0006 0.0004 0.0005 19.2767 25.6561 35.3454
frequency: 16.4546 25.3805 35.0891 58.1330 108.5288 114.4236 131.4558 144.9752 150.2268 155.7027 197.8068 199.3923 224.6539 242.4053 256.7872 259.9282 296.4124 326.1081 340.5938 363.1821 370.7622 388.6932 410.4700 433.2766 436.9999 453.0942 456.1627 474.0027 531.4801 557.2088 565.2961 580.5321 594.8956 621.0374 635.7561 701.8247 725.3550 728.2911 749.4012 764.9629 766.6059 799.1576 812.2735 815.7644 822.0456 851.7549 859.1069 886.1828 913.4352 930.0476 931.6799 948.9237 963.9392 969.2524 980.1887 983.4385 1001.9437 1021.1212 1025.4194 1046.6255 1065.4486 1083.1908 1095.0373 1112.8774 1118.9736 1124.5698 1127.3472 1130.7828 1144.9499 1154.6734 1163.1993 1167.6363 1173.7548 1197.9364 1218.1229 1243.6224 1248.9451 1259.9294 1277.3039 1278.9171 1291.0552 1299.0321 1317.6997 1331.5531 1342.6395 1346.0968 1347.5665 1361.3214 1365.5141 1377.0951 1395.2130 1407.6150 1429.9800 1430.2033 1455.3666 1456.2623 1458.5514 1460.0973 1461.6156 1465.1491 1466.7955 1471.7958 1475.5787 1478.8106 1481.3919 1482.6496 1494.3255 1580.6594 1590.0642 1613.3340 1637.3816 2788.5404 2813.2334 2853.6328 2948.7272 2952.1801 2974.6667 2990.7768 2991.6355 3004.8047 3017.0492 3025.3393 3037.4906 3041.2573 3045.8366 3055.7094 3075.6086 3121.3166 3124.0763 3132.9527 3138.7830 3146.4776 3162.5876 3163.1942 3173.7996
redmass: 3.5134 3.9122 4.2981 3.8270 4.0160 2.9154 3.8593 2.8005 3.3587 3.5214 2.1528 3.3744 1.2408 3.0854 1.7612 1.7860 2.3424 5.6884 2.0689 4.4674 2.6662 4.9890 2.3225 2.6258 2.7315 3.1804 4.1367 3.1854 5.7782 2.6103 4.2797 3.7442 4.3924 4.0135 4.7687 5.4922 2.5978 5.0536 1.6131 2.4377 2.5644 3.9570 1.7860 2.6387 1.7470 1.4874 1.4321 2.0447 2.7265 1.4369 2.3788 1.3504 2.2701 1.3051 1.7373 4.4774 3.8871 2.0380 1.9701 3.5155 2.2216 2.0386 1.5564 1.2609 1.6071 2.4042 1.4652 1.8214 1.2336 1.3801 2.0343 1.1925 1.8142 2.0176 1.8622 1.7741 2.1281 1.3426 1.2881 1.6798 1.4273 1.6523 1.3653 1.6704 1.5447 2.3423 1.4073 1.4815 1.5620 1.4299 5.9194 4.1819 1.1777 1.3322 2.4003 1.1221 1.1323 1.7868 1.2122 1.0587 1.1109 1.4263 1.1298 2.0212 1.0836 1.1748 3.7914 7.9351 7.0595 7.2562 7.5659 1.0703 1.0700 1.0572 1.0663 1.0333 1.0628 1.0612 1.0822 1.0872 1.0723 1.0869 1.1036 1.0966 1.0975 1.1027 1.1009 1.0988 1.0847 1.0891 1.0893 1.0949 1.0976 1.0931 1.0954
irintensity: 0.0717 0.0439 0.1123 2.2962 2.2665 0.2887 0.4176 1.4375 0.5059 3.3799 2.0942 2.4077 0.1946 1.0755 0.2237 0.5539 5.4642 0.3979 2.1202 0.2021 3.1373 6.9757 0.8781 4.1018 4.6742 2.6210 2.7769 3.3663 14.2358 2.3634 2.6177 2.2937 1.2727 5.9758 2.0083 6.8620 25.3861 2.8494 67.9981 12.7157 6.0892 0.3261 0.5048 0.8524 76.0150 0.4345 7.2077 12.7347 12.8635 2.4942 5.4198 0.0029 2.9308 0.0650 19.0932 11.7362 17.1588 11.7181 18.4004 12.7464 23.4606 1.2376 19.3367 0.2491 44.8096 4.4215 20.6112 10.4633 1.6971 4.7027 33.1927 3.0339 147.6243 56.4081 8.9344 22.6552 20.7547 16.2766 13.3825 9.3250 1.1819 1.4316 6.9219 14.4706 17.1152 79.6848 13.2870 3.2827 6.3626 2.2001 25.3830 31.8318 3.4754 15.3784 36.4645 13.4435 6.6552 98.2047 28.2164 12.9575 12.2590 33.5987 2.8411 1.6837 20.5693 38.6777 48.7571 6.9753 2.9429 125.4451 101.3432 68.2196 89.9086 193.1516 29.7615 68.2729 40.4174 26.2090 16.5235 33.9855 44.7951 63.3777 50.9146 21.0873 20.3177 59.1586 35.9387 30.2301 0.7681 6.1886 6.5694 39.2227 40.3694 6.2808 9.1576
temp: 298.150 k
press: 1.00000 atm
elementType: 8 7 7 6 6 6 6 6 6 6 6 6 6 6 6 6 6 6 6 6 6 6 6 1 1 1 1 1 1 1 1 1 1 1 1 1 1 1 1 1 1 1 1 1 1 1 1
symmnumber: 1
zpe: 1040125.2 jmol-1
zpe.correction: 0.396163 hartree
zpe.thermalcorrener: 0.416763 hartree
zpe.thermalcorrenthalpy: 0.417707 hartree
zpe.thermalcorrgfe: 0.345882 hartree
zpe.sumelectzpe: -959.567982 hartree
zpe.sumelectthermal: -959.547382 hartree
zpe.sumelectthermalent: -959.546438 hartree
zpe.sumelectthermalfe: -959.618263 hartree
dipole: 3.3692 -1.9821 -1.2828
dipole: 4.1141
quadrupole: -135.3095 -127.4137 -139.0221
quadrupole: -6.5745 -5.9853 2.8761
quadrupole: -1.3944 6.5014 -5.1070 -6.5745 -5.9853 2.8761
hfenergy: -959.9641451 hartree
pointgroup: C01 [X(C20H24N2O1)]
dipole: 1.4870628 -0.3718558 -0.519887 debye
polarizability: 256.8111148|-0.554629|324.5171843|-27.0853205|7.6427655|146.872484 unknown
InChI: InChI=1S/C20H24N2O/c1-21-11-5-6-15(13-21)14-22-19-8-4-3-7-17(19)18-10-9-16(23-2)12-20(18)22/h3-4,7-10,12,15H,5-6,11,13-14H2,1-2H3
charge 0 multiplicity 1
47 atoms
O  -1.739189 -4.434761 -0.365312
N  4.538136 1.069005 0.135888
N  -0.374053 0.388205 -0.637611
C  2.096706 0.617609 -0.139762
C  2.200625 -0.544037 0.876088
C  3.457331 0.820749 -0.844465
C  0.983231 0.393583 -1.195096
C  3.364483 -0.292443 1.860248
C  4.681663 -0.05128 1.096856
C  -1.17713 -0.7394 -0.374693
C  -1.09924 1.547275 -0.28816
C  -2.440663 -0.298382 0.147077
C  -2.393461 1.156131 0.204065
C  5.815098 1.411091 -0.519122
C  -0.876686 -2.107785 -0.568929
C  -0.715685 2.902097 -0.381454
C  -3.421938 -1.263913 0.478721
C  -3.310328 2.152748 0.61144
C  -1.883881 -3.041385 -0.229918
C  -1.650694 3.878749 0.028329
C  -3.146106 -2.627845 0.290388
C  -2.933351 3.510487 0.521394
C  -0.471088 -4.934099 -0.894668
H  1.872312 1.548162 0.419075
H  2.385358 -1.491877 0.324617
H  1.247299 -0.666647 1.421728
H  3.678479 -0.082842 -1.479614
H  3.404678 1.692696 -1.526026
H  1.148871 -0.566496 -1.718785
H  1.038848 1.190967 -1.963604
H  3.141386 0.597938 2.478453
H  3.486029 -1.154068 2.544259
H  5.49352 0.201981 1.804188
H  4.981364 -0.999083 0.571362
H  6.56995 1.663487 0.247026
H  5.678213 2.295297 -1.167524
H  6.227447 0.581214 -1.149066
H  0.093397 -2.428007 -0.957082
H  0.270452 3.198453 -0.754103
H  -4.393973 -0.955524 0.878618
H  -4.301332 1.877873 0.989828
H  -1.380518 4.939085 -0.031931
H  -3.879666 -3.401333 0.534519
H  -3.634058 4.29237 0.834031
H  0.377937 -4.656449 -0.238668
H  -0.28503 -4.557307 -1.920054
H  -0.578141 -6.028687 -0.916853
