program: Gaussian 09
title: 000049541
version: EM64L-G09RevD.01
frameworkgroup: C1[X(C18H20N2)]
method: RPBEPBE
basis: SDD
operation: Freq
keyword: #pfreq=noraman
keyword: PBEPBE/SDD
title: #p freq=noraman PBEPBE/SDD
converged: YES YES NO NO
title: Mulliken charges:
elementType: N N C C C C C C C C C C C C C C C C C C H H H H H H H H H H H H H H H H H H H H
charge: -0.281415 -0.052710 -0.055852 -0.446704 -0.450072 -0.383445 -0.374623 0.242493 0.221114 0.159561 0.178775 -0.622721 -0.314165 -0.361644 -0.400177 -0.396679 -0.268294 -0.234965 -0.254324 -0.256340 0.216274 0.212170 0.235879 0.195707 0.240936 0.208855 0.201227 0.214688 0.174554 0.224719 0.228205 0.190051 0.222434 0.232271 0.235216 0.233224 0.219503 0.220994 0.222979 0.222299
chargesum: 0.00000
title: Mulliken charges with hydrogens summed into heavy atoms:
elementType: N N C C C C C C C C C C C C C C C C C C
charge: -0.281415 -0.052710 0.160422 0.001346 -0.013429 0.026637 0.014619 0.242493 0.221114 0.159561 0.178775 0.020255 -0.091731 -0.129373 -0.164960 -0.163456 -0.048792 -0.013970 -0.031345 -0.034041
polarizability: 2.46329144e+02 -1.08352100e+01 2.65546174e+02 -8.35132467e+00 -1.13874895e+00 1.21459309e+02
1716.lowfreq: -10.4907 -1.9463 -0.0009 -0.0005 -0.0001 8.8303 41.5801 48.1585 66.9553
frequency: 41.3758 48.0304 66.9239 109.9510 142.3630 153.1572 177.6828 186.6236 209.5477 223.5723 263.2125 281.3897 288.8323 338.6983 359.5815 408.1969 421.2794 427.9076 431.8632 451.3991 455.8226 508.8265 524.1674 576.8484 577.8473 601.2887 614.3898 653.4338 725.7792 729.5845 744.6152 754.8349 765.6058 775.9455 777.7761 847.6453 852.8892 859.1531 864.0259 873.4413 907.2472 931.2562 934.8853 962.2146 968.9770 971.9630 978.9702 990.0482 1019.3232 1022.0968 1026.8025 1054.3326 1067.1593 1093.1233 1116.4989 1122.4901 1124.0681 1131.9206 1145.9876 1165.6738 1169.8666 1174.1617 1203.2636 1221.0126 1240.0231 1256.3152 1263.8547 1281.8374 1301.1594 1312.5438 1313.5525 1333.7089 1335.3450 1343.9046 1348.2889 1364.9918 1382.6281 1402.5150 1410.3855 1431.2396 1449.1177 1450.7619 1457.8968 1461.7173 1462.9685 1470.4195 1473.8707 1480.2088 1481.4021 1489.0570 1580.8337 1587.5755 1607.5266 1635.9796 2819.9043 2855.5537 2869.5596 2990.9592 2999.4007 3022.1653 3028.4473 3032.5657 3041.2432 3050.7708 3067.1465 3080.7079 3124.8681 3125.7504 3133.2528 3135.3432 3147.7403 3154.2675 3164.0792 3166.7049
redmass: 3.6262 4.0149 3.2874 4.2061 2.7900 3.1825 4.1406 2.1620 3.1657 1.4222 2.0257 4.8517 4.5537 2.8003 2.2641 2.9974 3.1188 5.2239 4.1535 2.8947 2.6096 2.2292 5.4442 3.7525 3.8773 4.6386 6.3277 5.8301 4.9264 2.2126 1.4764 1.7858 2.4831 3.6554 3.2250 1.3758 1.5973 1.4356 3.0180 3.2147 2.3270 1.3836 1.4056 1.7014 1.3136 1.3077 2.2166 7.3053 2.2727 1.8863 1.9497 2.9147 1.9384 1.6041 2.5341 1.6449 1.6143 1.6518 1.2666 1.6418 1.1072 1.4054 1.7980 2.1663 2.0277 1.8998 1.3108 1.5478 1.4855 1.8704 1.3146 1.7009 2.0000 1.4099 1.5388 1.4673 1.6024 4.6193 2.9130 1.1743 2.8852 3.3496 1.0920 1.0626 1.0747 1.1745 2.4992 1.1153 1.0561 3.9119 6.9644 6.6307 7.2704 7.6442 1.0707 1.0624 1.0628 1.0601 1.0617 1.0731 1.0848 1.0861 1.0910 1.1005 1.1022 1.1011 1.0849 1.0849 1.0892 1.0900 1.0947 1.0946 1.1001 1.0992
irintensity: 0.2983 0.0422 0.3938 0.8427 1.7361 1.3951 0.1618 0.3201 1.6230 0.8938 2.0973 0.8411 0.0127 1.2278 2.6380 3.1931 9.3143 2.6656 0.2813 0.0218 0.1589 3.3448 2.5924 1.2135 1.5074 2.0138 3.9557 7.7146 1.9419 59.8198 3.7295 128.1528 7.3338 2.3827 1.8074 0.8420 0.0594 5.7662 2.3591 7.9335 1.5495 2.0443 0.8414 3.4405 0.0675 0.1460 8.5923 7.4204 2.0945 22.4563 18.3587 0.5509 24.0557 13.2616 6.3031 10.6475 3.6089 12.9109 4.2458 11.2232 3.7391 29.7186 6.2192 48.2734 4.2306 17.9735 4.1325 5.1403 9.3451 7.7630 3.5478 14.7602 52.0693 3.5838 17.7586 6.6613 12.2567 2.4871 16.6593 1.4497 11.2636 99.9989 15.0761 24.5407 3.5619 11.2765 31.0119 19.5421 8.2615 29.5207 0.1908 1.0360 32.6569 15.8986 74.8046 78.9625 150.1443 30.6316 24.0812 41.3918 44.5230 24.6629 28.8809 18.5954 49.2338 35.3371 0.1213 1.0424 11.1687 3.1520 32.3307 44.7358 42.6909 17.9055
temp: 298.150 k
press: 1.00000 atm
elementType: 7 7 6 6 6 6 6 6 6 6 6 6 6 6 6 6 6 6 6 6 1 1 1 1 1 1 1 1 1 1 1 1 1 1 1 1 1 1 1 1
symmnumber: 1
zpe: 885481.3 jmol-1
zpe.correction: 0.337262 hartree
zpe.thermalcorrener: 0.353740 hartree
zpe.thermalcorrenthalpy: 0.354684 hartree
zpe.thermalcorrgfe: 0.293559 hartree
zpe.sumelectzpe: -805.992532 hartree
zpe.sumelectthermal: -805.976054 hartree
zpe.sumelectthermalent: -805.975110 hartree
zpe.sumelectthermalfe: -806.036235 hartree
dipole: -2.4953 0.2799 0.1464
dipole: 2.5152
quadrupole: -106.7235 -113.5306 -122.5461
quadrupole: -1.9041 -1.5648 -0.6080
quadrupole: 7.5432 0.7361 -8.2794 -1.9041 -1.5648 -0.6080
hfenergy: -806.3297942 hartree
pointgroup: C01 [X(C18H20N2)]
dipole: 0.9865498 0.0530291 -0.0559005 debye
polarizability: 247.6649932|11.6533878|264.2555336|-8.174486|-1.8028623|121.4140992 unknown
InChI: InChI=1S/C18H20N2/c1-19-12-6-7-14(13-19)20-17-10-4-2-8-15(17)16-9-3-5-11-18(16)20/h2-5,8-11,14H,6-7,12-13H2,1H3
charge 0 multiplicity 1
40 atoms
N  -0.017783 -0.175928 -0.138897
N  3.624279 -0.742331 0.765894
C  1.388516 -0.601003 -0.293772
C  2.024795 -0.136257 -1.627834
C  2.262308 -0.181524 0.916857
C  3.479922 -0.649849 -1.71639
C  4.286391 -0.245343 -0.465739
C  -0.519753 1.145222 -0.088774
C  -1.107352 -1.070253 -0.027314
C  -1.952259 1.091364 0.054793
C  -2.324482 -0.314765 0.093044
C  4.447618 -0.537581 1.974444
C  0.154138 2.3882 -0.152763
C  -1.118213 -2.483336 -0.024693
C  -2.702353 2.287426 0.131601
C  -3.561725 -0.988109 0.216354
C  -0.61589 3.568148 -0.075309
C  -2.364988 -3.134006 0.098916
C  -2.031028 3.525304 0.065494
C  -3.577407 -2.398375 0.218416
H  1.388462 -1.705893 -0.298948
H  2.017408 0.96837 -1.688567
H  1.421862 -0.510003 -2.475559
H  2.283149 0.934521 1.007031
H  1.811293 -0.579531 1.843955
H  3.484187 -1.753799 -1.796812
H  3.970877 -0.24621 -2.622019
H  5.302472 -0.678973 -0.512123
H  4.401306 0.872249 -0.442391
H  5.422542 -1.041394 1.849061
H  3.94164 -0.983499 2.849067
H  4.642065 0.541332 2.20107
H  1.240646 2.454068 -0.254135
H  -0.199478 -3.072008 -0.112682
H  -3.79207 2.251909 0.241706
H  -4.495973 -0.422837 0.309072
H  -0.108815 4.538582 -0.123336
H  -2.397334 -4.229411 0.103445
H  -2.597184 4.461026 0.123877
H  -4.526989 -2.935902 0.313059
