program: Gaussian 09
title: 000049530
version: EM64L-G09RevD.01
frameworkgroup: C1[X(C19H21ClN2)]
method: RPBEPBE
basis: SDD
operation: Freq
keyword: #p
keyword: freq=noraman
keyword: PBEPBE/SDD
title: #p freq=noraman PBEPBE/SDD
converged: NO YES NO NO
title: Mulliken charges:
elementType: Cl N N C C C C C C C C C C C C C C C C C C C H H H H H H H H H H H H H H H H H H H H H
charge: -0.072546 -0.088994 -0.228555 -0.004803 -0.397116 -0.557149 -0.431728 -0.379767 -0.377799 0.250413 0.194775 -0.640317 0.188986 0.189702 -0.301851 -0.342594 -0.388488 -0.396536 -0.117381 -0.235878 -0.260037 -0.251598 0.202379 0.195513 0.228650 0.249623 0.241115 0.219779 0.194090 0.174479 0.211086 0.195825 0.206287 0.235045 0.224255 0.188934 0.267427 0.238693 0.240949 0.235574 0.222984 0.252107 0.224468
chargesum: 0.00000
title: Mulliken charges with hydrogens summed into heavy atoms:
elementType: Cl N N C C C C C C C C C C C C C C C C C C C
charge: -0.072546 -0.088994 -0.228555 0.197575 0.027047 -0.066411 -0.017860 0.005797 0.024312 0.250413 0.194775 0.007917 0.188986 0.189702 -0.034424 -0.103901 -0.147539 -0.160961 -0.117381 -0.012894 -0.007930 -0.027130
polarizability: 2.57288854e+02 2.57128811e+01 3.05537574e+02 -2.37096309e+01 1.13499747e+01 1.40784003e+02
1716.lowfreq: -20.6134 -12.9906 -6.7902 -0.0009 -0.0001 0.0012 7.8425 28.0219 40.4252
frequency: -14.3815 27.2999 40.2689 64.9345 82.0630 134.1711 141.1924 159.4168 164.5177 193.0247 196.7874 233.7638 259.4995 280.4063 296.0132 323.9271 329.0759 342.6526 351.1774 407.3908 423.4198 432.0184 442.6720 453.8798 485.0043 494.2651 539.7605 546.7333 573.4800 590.1970 592.1584 627.0614 656.9983 722.5766 723.1600 745.8191 753.2989 763.0862 788.6017 811.8267 818.4425 821.1114 842.4587 853.4731 868.0423 881.6025 906.6768 934.9287 942.4583 963.1781 973.0874 985.9013 991.5993 1020.1329 1032.6524 1043.2903 1050.7007 1057.5389 1069.8990 1097.2720 1108.9116 1123.9546 1126.6264 1133.7697 1139.5485 1149.6950 1168.6265 1195.1038 1213.7660 1232.6756 1249.7444 1257.9031 1267.1028 1272.2212 1292.4028 1302.5938 1316.8797 1332.7400 1338.7141 1342.3977 1345.9872 1352.6666 1363.8192 1372.7274 1392.2911 1406.8857 1434.3185 1440.3652 1449.3535 1450.7664 1460.0348 1464.1354 1466.4554 1469.7330 1477.1204 1482.0785 1486.0099 1493.9333 1574.3963 1587.2782 1605.1500 1635.8688 2809.2595 2828.3632 2855.3147 2970.1566 2983.3802 2987.2089 3009.1589 3024.2544 3034.0197 3039.7945 3051.5210 3060.6292 3070.7864 3085.8944 3127.1194 3135.6570 3143.1409 3149.0482 3165.1779 3170.4407 3176.4861
redmass: 3.3857 5.0576 4.2923 6.8426 2.9751 5.3182 3.8730 2.5583 3.7122 5.6837 1.9977 2.6991 2.0413 3.2143 2.4284 4.6621 1.9094 5.7658 4.9455 3.1184 2.6895 2.9805 2.8802 3.1718 2.9059 6.2576 5.4141 1.7590 3.5869 4.4499 4.7918 6.3825 6.9408 4.5301 3.4443 2.5404 2.1271 2.1593 4.6580 1.5725 2.3253 1.5402 1.4787 1.4781 2.1578 2.7018 1.9779 1.3893 1.3570 2.1846 1.3089 5.2220 1.6676 1.9703 1.7824 3.6900 2.2172 2.1287 3.1027 1.5448 1.6094 1.8530 1.5095 1.6377 2.0308 1.6637 1.1022 1.9635 1.7044 1.8420 1.7277 1.6029 1.2482 1.3593 1.9327 1.2281 1.4210 1.5658 1.5741 2.1874 1.4535 1.4859 1.4851 1.3992 5.4123 4.3366 1.1698 3.4184 3.0817 1.1074 1.0898 1.2387 2.2094 1.1508 1.0930 1.0792 1.8396 1.6202 8.1928 6.9234 7.6957 7.8338 1.0795 1.0703 1.0582 1.0640 1.0623 1.0615 1.0591 1.0875 1.0721 1.0963 1.1020 1.1015 1.1030 1.1002 1.0849 1.0892 1.0896 1.0950 1.1002 1.0927 1.0958
irintensity: 0.0572 0.0268 0.1104 0.0048 0.6958 0.0808 0.1068 0.3731 2.6521 0.5988 0.2519 0.5932 0.3239 4.2210 1.2349 0.6589 0.9743 2.1289 5.2556 2.5595 6.4306 5.0209 0.6402 2.0032 0.4505 12.2097 1.4883 1.6296 2.0216 6.4820 1.7614 6.2664 10.3187 1.9465 12.0843 28.3658 42.1553 43.2223 8.1795 25.9041 13.7581 2.8253 26.5478 1.0864 50.8339 2.7620 13.4339 1.8962 0.1828 5.8982 0.0951 17.3317 7.5360 8.0010 33.7327 8.6947 9.1742 25.6102 11.0710 9.6389 4.2112 5.5460 3.7068 16.7379 6.3910 3.0547 4.4989 11.8983 18.4005 9.7866 6.5068 16.6656 2.1445 17.8116 3.3282 12.3124 8.7140 21.9652 6.3287 35.9553 0.1412 10.6946 1.1228 2.9965 35.9885 22.5842 4.4321 56.0711 44.7552 15.8668 7.2219 21.6621 31.9598 6.7867 21.4159 47.4633 23.0342 29.8052 7.9158 6.8111 91.0732 25.8260 51.1909 77.1681 142.2730 30.9428 27.8435 31.8926 21.0468 59.4855 58.0724 42.5746 40.5516 42.1033 16.7417 40.5826 0.8065 5.0573 4.5727 34.7794 32.3066 3.1241 4.1100
temp: 298.150 k
press: 1.00000 atm
elementType: 17 7 7 6 6 6 6 6 6 6 6 6 6 6 6 6 6 6 6 6 6 6 1 1 1 1 1 1 1 1 1 1 1 1 1 1 1 1 1 1 1 1 1
symmnumber: 1
zpe: 933096.8 jmol-1
zpe.correction: 0.355398 hartree
zpe.thermalcorrener: 0.373649 hartree
zpe.thermalcorrenthalpy: 0.374593 hartree
zpe.thermalcorrgfe: 0.308945 hartree
zpe.sumelectzpe: -1304.605554 hartree
zpe.sumelectthermal: -1304.587303 hartree
zpe.sumelectthermalent: -1304.586359 hartree
zpe.sumelectthermalfe: -1304.652007 hartree
dipole: 3.0031 2.1564 0.1937
dipole: 3.7021
quadrupole: -126.4188 -140.7525 -139.3027
quadrupole: -5.2699 -5.9128 -0.6254
quadrupole: 9.0725 -5.2611 -3.8114 -5.2699 -5.9128 -0.6254
hfenergy: -1304.9609516 hartree
pointgroup: C01 [X(C19H21Cl1N2)]
dipole: -0.7831794 -1.2057636 0.2329377 debye
polarizability: 246.8260387|5.0910796|313.5985232|24.531568|-22.9170958|143.1858694 unknown
InChI: InChI=1S/C19H21ClN2/c1-21-11-5-4-6-15(21)13-22-18-8-3-2-7-16(18)17-10-9-14(20)12-19(17)22/h2-3,7-10,12,15H,4-6,11,13H2,1H3
charge 0 multiplicity 1
43 atoms
Cl 1.435999 4.878095 -1.042328
N  -3.541944 -0.444332 -0.695484
N  0.2751 -0.302681 -0.60032
C  -2.195589 -0.447491 -0.048151
C  -2.064098 0.741434 0.932141
C  -1.087643 -0.374806 -1.140953
C  -3.188228 0.749563 1.987798
C  -4.639506 -0.460512 0.314857
C  -4.558625 0.734325 1.280249
C  1.07573 0.848833 -0.489191
C  1.018149 -1.409485 -0.137906
C  -3.735951 -1.546369 -1.667334
C  2.357175 0.478546 0.05456
C  2.319501 -0.960475 0.278124
C  0.769888 2.184636 -0.831881
C  0.6441 -2.769064 -0.068994
C  3.34073 1.473522 0.255687
C  3.253997 -1.897893 0.775984
C  1.783656 3.133317 -0.615965
C  1.596366 -3.686308 0.425912
C  3.056356 2.814132 -0.081285
C  2.886889 -3.25845 0.847129
H  -2.051236 -1.39894 0.533983
H  -2.109304 1.682881 0.34892
H  -1.073755 0.697481 1.419863
H  -1.277595 0.514147 -1.768589
H  -1.134978 -1.259306 -1.800753
H  -3.091463 1.636293 2.64176
H  -3.09752 -0.144379 2.639127
H  -4.618143 -1.411554 0.911569
H  -5.600027 -0.440367 -0.233408
H  -5.384118 0.666846 2.014491
H  -4.693667 1.671846 0.707088
H  -3.092981 -1.418598 -2.554104
H  -4.782037 -1.53037 -2.020075
H  -3.538139 -2.558748 -1.230019
H  -0.198844 2.48258 -1.239696
H  -0.347348 -3.110568 -0.383549
H  4.321757 1.216198 0.668816
H  4.249974 -1.57571 1.099552
H  1.334899 -4.748574 0.489637
H  3.799976 3.601912 0.06498
H  3.599893 -3.99661 1.229659
