program: Gaussian 09
title: 000006827
version: EM64L-G09RevD.01
frameworkgroup: C1[X(C20H26O2)]
method: RPBEPBE
basis: SDD
operation: Freq
keyword: #pfreq=noraman
keyword: PBEPBE/SDD
title: #p freq=noraman PBEPBE/SDD
converged: YES YES NO NO
title: Mulliken charges:
elementType: O O C C C C C C C C C C C C C C C C C C C C H H H H H H H H H H H H H H H H H H H H H H H H H H
charge: -0.436496 -0.436603 -0.037786 -0.253251 -0.227941 -0.433590 -0.418170 0.547063 0.489312 -0.779557 -0.707112 -0.710416 -0.441717 -0.375835 -0.415956 -0.354666 -0.396906 -0.374105 -0.395859 -0.378190 0.275288 0.277395 0.198886 0.214825 0.209765 0.227842 0.224297 0.198171 0.211528 0.224571 0.224644 0.216156 0.214588 0.220022 0.207949 0.237635 0.202806 0.212600 0.227352 0.228560 0.229550 0.223640 0.216501 0.246919 0.215596 0.247134 0.352008 0.351554
chargesum: 0.00000
title: Mulliken charges with hydrogens summed into heavy atoms:
elementType: O O C C C C C C C C C C C C C C C C C C C C
charge: -0.084488 -0.085050 0.161100 -0.038427 -0.018176 0.018549 -0.008471 0.547063 0.489312 -0.114186 -0.064552 -0.057375 -0.214365 -0.147276 -0.186406 -0.131025 -0.180405 -0.127186 -0.180263 -0.131056 0.275288 0.277395
polarizability: 2.81992281e+02 3.11949125e+00 1.87848132e+02 9.14742810e+00 1.45887688e+01 1.97613348e+02
1716.lowfreq: -14.2141 -7.4652 -0.0006 0.0004 0.0006 3.0118 13.6932 23.1288 30.5737
frequency: 13.3961 22.8517 30.0075 47.9835 52.4872 64.8848 89.2150 107.1253 139.7622 149.8917 166.3424 175.4145 192.9501 213.8429 223.9545 235.0523 243.7829 258.2017 273.5937 328.8880 341.0002 347.9227 348.8406 369.8574 382.6710 392.0917 408.6019 410.1881 419.1063 456.8547 471.4591 508.0377 530.4111 537.4840 563.7983 624.7233 635.8761 641.6987 688.6358 720.1479 731.7513 741.1463 756.5574 791.1762 804.0218 806.7969 807.5685 822.6817 833.6688 836.2834 841.4996 886.3584 908.6920 927.3910 931.1833 957.1247 958.5742 981.4285 1000.4611 1002.7665 1013.3710 1016.7179 1035.7350 1051.5613 1067.7272 1085.0349 1093.0960 1104.4050 1124.5808 1132.4187 1142.2410 1144.0650 1158.4860 1177.9483 1180.4457 1201.5363 1206.8759 1229.5707 1243.7231 1245.4218 1248.2178 1261.3911 1287.3275 1293.5816 1300.6239 1320.2109 1326.5258 1337.0391 1344.6539 1353.6407 1360.6713 1385.1142 1388.8574 1390.3267 1393.5852 1397.2527 1426.2064 1426.8421 1466.9107 1471.1915 1473.6311 1474.8432 1479.5086 1484.7031 1487.7602 1495.6796 1501.1495 1501.7344 1595.0927 1596.8206 1624.1977 1625.0799 2925.6971 2964.3459 2968.4613 2974.8033 2981.3814 2986.1132 2990.4859 2991.9479 3033.8390 3035.1482 3065.4540 3067.5367 3072.6108 3079.9115 3083.7445 3097.5820 3104.0530 3106.4877 3121.0440 3128.2129 3131.3858 3138.7235 3165.6303 3167.8160 3581.1107 3582.3500
redmass: 3.4869 4.4619 4.4536 4.0615 3.3647 4.0366 2.0949 2.7042 1.9885 3.4997 2.7190 2.5051 3.0195 3.1213 2.2410 1.3983 1.7288 1.9830 2.3783 2.8970 3.0457 1.1270 1.1645 4.0259 3.9626 3.5787 2.9204 2.9074 4.1361 3.3650 3.2253 3.3580 2.5411 4.0217 2.6758 3.3697 6.8844 4.2541 3.2794 2.3240 3.4528 2.7981 1.6700 1.9844 3.1218 1.4428 1.4073 3.1748 1.5414 1.7555 1.8692 2.1853 1.8911 1.4049 1.3632 1.3733 1.3612 2.1471 2.8494 2.8126 1.6508 1.7201 1.7425 1.9945 1.6381 2.0809 1.7531 1.4910 1.8636 2.2400 1.4625 1.3719 2.4665 1.1079 1.1099 2.1918 2.0526 1.4577 1.6845 2.5846 1.9166 1.3787 1.2058 1.3817 1.2804 1.2576 1.4166 1.3331 1.4312 1.4664 1.3310 1.3562 1.2617 2.7107 4.0251 1.3527 2.5766 2.5544 1.0566 1.0659 1.0475 1.0519 1.0598 1.0667 1.0877 1.1034 2.2915 2.6233 6.3687 6.2295 6.4585 6.4187 1.0809 1.0786 1.0696 1.0372 1.0391 1.0729 1.0417 1.0597 1.0962 1.0991 1.0992 1.0983 1.0989 1.1003 1.0997 1.0964 1.0868 1.0871 1.0890 1.0963 1.0961 1.0880 1.0950 1.0958 1.0660 1.0660
irintensity: 1.1990 0.3282 0.4754 0.3009 0.1265 0.0956 0.1181 0.0200 0.0994 0.3553 0.7791 0.1095 0.2679 0.9925 0.0055 0.1252 0.1361 0.1965 0.0423 0.3978 7.0660 95.3779 181.6319 7.5524 7.9256 3.0646 1.0583 1.7270 13.6338 2.0003 0.9366 10.1186 39.3027 8.0237 14.5927 5.2338 0.8270 2.6932 24.0125 4.5775 2.7108 0.2147 8.5462 43.7733 24.7083 22.0750 8.6967 1.9708 49.8671 25.7370 7.8986 12.2383 1.0192 0.2400 0.2322 0.3867 0.3198 1.1087 10.4413 3.5083 3.1540 3.9997 0.1260 8.8063 9.4743 1.7994 53.8918 13.6833 46.1837 89.5590 164.9566 219.0189 1.6995 8.0285 5.5257 1.9822 0.2232 4.3059 8.1597 40.7305 19.6114 3.3752 9.7858 11.9583 6.9428 7.3866 13.6946 9.0556 2.9864 6.3125 0.4687 1.7703 17.1421 14.1939 16.3775 28.0111 12.8020 10.2326 3.5993 3.6449 5.8923 6.4585 16.1270 7.0418 7.0159 20.8133 133.7544 63.2441 11.9596 7.4971 29.8230 30.8505 12.9689 21.9669 23.5383 35.4791 9.9406 37.7367 63.4962 8.5965 25.5050 24.4647 51.0560 43.2754 48.3929 67.0760 62.1841 27.9813 25.2307 21.2775 19.1744 22.2655 15.2949 10.3484 6.6243 8.3785 41.1765 37.9982
temp: 298.150 k
press: 1.00000 atm
elementType: 8 8 6 6 6 6 6 6 6 6 6 6 6 6 6 6 6 6 6 6 6 6 1 1 1 1 1 1 1 1 1 1 1 1 1 1 1 1 1 1 1 1 1 1 1 1 1 1
symmnumber: 1
zpe: 1069924.3 jmol-1
zpe.correction: 0.407513 hartree
zpe.thermalcorrener: 0.430352 hartree
zpe.thermalcorrenthalpy: 0.431296 hartree
zpe.thermalcorrgfe: 0.353743 hartree
zpe.sumelectzpe: -926.513437 hartree
zpe.sumelectthermal: -926.490598 hartree
zpe.sumelectthermalent: -926.489654 hartree
zpe.sumelectthermalfe: -926.567207 hartree
dipole: 0.9500 0.7656 -0.2731
dipole: 1.2503
quadrupole: -132.3181 -136.5527 -122.8316
quadrupole: 3.8518 20.6200 3.8550
quadrupole: -1.7506 -5.9852 7.7358 3.8518 20.6200 3.8550
hfenergy: -926.9209501 hartree
pointgroup: C01 [X(C20H26O2)]
dipole: -0.3714175 -0.3078966 -0.0961122 debye
polarizability: 281.7915852|3.6999678|187.0846292|-9.6860664|-14.4024806|198.5775467 unknown
InChI: InChI=1S/C20H26O2/c1-4-19(14(3)15-6-10-17(21)11-7-15)20(5-2)16-8-12-18(22)13-9-16/h6-14,19-22H,4-5H2,1-3H3
charge 0 multiplicity 1
48 atoms
O  -5.804342 2.303521 -0.249445
O  6.196753 1.879775 -0.477166
C  0.130311 -0.419195 0.045809
C  -1.220579 -1.224864 0.062114
C  1.408187 -1.351368 -0.003586
C  0.16909 0.704075 1.129125
C  -1.304739 -2.277456 -1.087381
C  -2.430534 -0.285091 0.007061
C  2.68946 -0.514982 -0.114924
C  1.482718 -2.432738 1.103116
C  0.000148 0.29831 2.612512
C  -2.598364 -3.120257 -1.06285
C  -3.399237 -0.275347 1.039127
C  -2.636805 0.588262 -1.096245
C  3.072064 0.006693 -1.377477
C  3.518143 -0.208731 0.997014
C  -4.531199 0.570004 0.988197
C  -3.756297 1.439228 -1.167466
C  4.225735 0.805053 -1.534515
C  4.675826 0.584395 0.862885
C  -4.70656 1.430382 -0.120093
C  5.028876 1.0952 -0.405754
H  0.153346 0.126587 -0.925292
H  -1.279649 -1.782931 1.019135
H  1.329286 -1.902768 -0.963562
H  1.120672 1.257377 1.017463
H  -0.634309 1.423922 0.880723
H  -1.220703 -1.755648 -2.063153
H  -0.4393 -2.963474 -1.025049
H  0.597004 -3.092243 1.07393
H  2.376485 -3.066116 0.954656
H  1.537543 -2.009202 2.119146
H  -0.092525 1.204657 3.239531
H  -0.909868 -0.306858 2.775196
H  0.862314 -0.275274 2.994357
H  -3.494526 -2.490055 -1.199256
H  -2.705582 -3.651711 -0.097623
H  -2.588576 -3.879866 -1.866154
H  -3.273673 -0.943963 1.899669
H  -1.910528 0.60588 -1.917949
H  2.461107 -0.22251 -2.259994
H  3.263943 -0.597209 1.989056
H  -5.266822 0.555429 1.803474
H  -3.912315 2.11122 -2.016867
H  4.499527 1.19008 -2.525965
H  5.312344 0.815228 1.722413
H  -6.407575 2.225164 0.530684
H  6.354425 2.188315 -1.403724
