program: Gaussian 09
title: 000049445
version: EM64L-G09RevD.01
frameworkgroup: C1[X(C18H25NO3)]
method: RPBEPBE
basis: SDD
operation: Freq
keyword: #p
keyword: freq=noraman
keyword: PBEPBE/SDD
title: #p freq=noraman PBEPBE/SDD
converged: YES YES NO NO
title: Mulliken charges:
elementType: O O O N C C C C C C C C C C C C C C C C C C H H H H H H H H H H H H H H H H H H H H H H H H H
charge: -0.262854 -0.268351 -0.260834 -0.110936 -0.475451 0.242347 0.073271 0.215053 -0.310137 -0.317881 0.168643 0.287639 0.102710 0.026272 -0.418282 -0.382865 -0.532914 -0.684175 -0.663692 -0.828644 -0.677478 -0.537413 0.207979 0.230127 0.177629 0.231586 0.184080 0.203964 0.280352 0.243411 0.236218 0.237445 0.230365 0.203908 0.204781 0.219623 0.211189 0.200846 0.230580 0.222131 0.283962 0.224909 0.229415 0.222934 0.247228 0.224508 0.226799
chargesum: 0.00000
title: Mulliken charges with hydrogens summed into heavy atoms:
elementType: O O O N C C C C C C C C C C C C C C C C C C
charge: -0.262854 -0.268351 -0.260834 -0.110936 -0.037344 0.242347 0.073271 0.215053 0.099078 0.070164 0.168643 0.287639 0.102710 0.026272 -0.137930 -0.139454 -0.059251 -0.045121 -0.032035 -0.091971 -0.000220 0.161122
polarizability: 2.75262319e+02 1.19551991e+01 2.47045028e+02 1.69276652e+01 -1.27617746e+01 1.46562468e+02
1716.lowfreq: -10.5279 -4.9433 -0.0010 -0.0008 -0.0005 2.3810 24.0266 28.5546 43.5547
frequency: 23.7511 28.1318 43.5227 49.2705 58.0844 65.7050 73.7177 90.5695 95.2505 104.6187 115.6410 143.8655 163.1912 169.1357 193.0047 204.2268 222.3071 225.3920 239.8626 278.4828 288.6966 290.9651 299.1641 323.1329 324.1717 339.8420 351.4274 357.4530 371.7176 426.2281 447.6691 462.7211 490.1351 518.2691 567.9933 583.1769 606.3642 611.8968 639.2850 656.8577 704.8391 726.2235 750.7016 778.7713 787.3443 792.7629 798.1652 814.3507 828.0164 872.7202 909.8415 936.1904 968.3191 973.2239 976.3643 983.8633 1015.0686 1034.9985 1039.1587 1057.6592 1063.6089 1073.0376 1076.4920 1085.5668 1110.7739 1112.8244 1132.0294 1145.3359 1161.4116 1165.8582 1185.0253 1193.9225 1203.4804 1242.3945 1245.4837 1264.0224 1270.5547 1282.7928 1285.9044 1317.7015 1357.9716 1361.2274 1364.9502 1373.9804 1383.3599 1385.2562 1390.0559 1390.7814 1394.3713 1423.3436 1438.4404 1455.4751 1458.6757 1462.0270 1465.7661 1467.4449 1468.7051 1470.6563 1471.4376 1474.8606 1477.3106 1483.7312 1486.7549 1487.2863 1489.3032 1491.6076 1542.9944 1576.3705 1614.0142 1628.2758 2841.0972 2852.5750 2920.9026 2966.4451 2979.0598 2980.8635 2981.6205 2988.8712 3007.9527 3037.0429 3046.3271 3050.5203 3057.8527 3059.9827 3072.8307 3073.6343 3075.6134 3088.0788 3088.2784 3090.6503 3093.1619 3100.0060 3127.0044 3152.4979 3173.2104
redmass: 3.1955 3.3579 3.2530 2.5819 3.3045 2.7860 1.9325 2.8152 2.0660 1.4834 4.7987 3.4601 2.1261 3.3098 1.3678 1.2675 1.9160 1.3486 1.8184 2.6608 2.7276 2.6082 2.4922 3.3066 3.3197 3.3802 3.9966 4.1927 3.5954 2.9666 4.6112 2.9112 6.2526 4.0589 4.5494 5.2168 4.9344 6.4739 4.2991 4.6154 4.2488 5.1474 3.0469 2.3472 1.3952 1.1948 1.5815 3.3177 1.7578 2.6539 2.5382 2.9893 2.3785 2.4583 1.3432 2.4193 3.0666 1.9305 1.4846 2.6110 1.9544 1.9994 2.5982 2.1189 1.2632 1.9447 2.2435 1.4258 2.6443 2.2872 1.5213 2.2670 2.8276 3.3071 3.7517 1.2623 1.3039 1.2308 1.1990 1.5033 2.1576 1.4241 1.5034 1.4297 1.2465 1.2370 1.3690 1.2535 5.5731 2.9582 1.3650 1.1214 1.0834 1.0570 1.0584 1.1178 1.1025 1.0643 1.1309 1.0470 1.0710 1.1581 1.3630 1.2855 1.0822 1.0502 10.3103 8.8880 7.6853 8.4863 1.0724 1.0718 1.0695 1.0325 1.0371 1.0356 1.0354 1.0348 1.0631 1.0869 1.0879 1.0895 1.1042 1.0982 1.0978 1.0975 1.0975 1.1007 1.1002 1.1001 1.0982 1.1008 1.1001 1.0877 1.0959
irintensity: 0.3548 0.3110 1.6855 0.6192 1.3116 1.1681 0.2657 0.4682 0.3816 0.0103 7.6078 3.7808 3.2582 0.3467 0.1672 0.7723 0.0268 0.1305 0.6794 3.1783 1.1024 0.3865 0.5068 2.5051 1.5876 1.7629 4.2003 3.0273 0.3719 6.9767 2.6931 2.1317 5.5488 13.6862 10.8680 4.5760 3.2588 1.4867 6.0777 2.6906 8.3287 8.1216 12.6612 10.7267 5.1210 3.7641 16.1305 9.4194 21.7908 2.8903 2.5778 4.4568 5.8036 12.2032 1.6639 3.0641 8.4765 39.5767 2.1055 28.8088 13.8921 12.6612 261.2422 10.2156 0.6744 6.8345 4.2970 5.2031 111.5792 29.1974 6.5693 20.0358 21.2649 117.3828 17.3982 16.3938 5.4513 20.4845 19.6625 10.5564 96.7642 39.8551 24.7855 1.0099 20.6977 26.6083 23.3705 54.9227 73.7791 28.7808 6.4349 13.9766 3.8778 13.0510 7.7942 9.9936 5.4171 21.4411 47.6426 21.4725 2.4827 9.0185 3.8041 11.9654 17.6879 13.3666 180.4411 20.1875 153.6014 173.1429 39.2177 185.8352 68.4285 77.9193 36.7221 38.4092 25.3137 33.4023 15.5113 11.6564 4.2104 10.2066 39.1467 21.1323 1.4229 33.5318 100.7893 32.6489 42.2188 47.9406 3.9562 40.9388 20.6523 0.9601 12.8753
temp: 298.150 k
press: 1.00000 atm
elementType: 8 8 8 7 6 6 6 6 6 6 6 6 6 6 6 6 6 6 6 6 6 6 1 1 1 1 1 1 1 1 1 1 1 1 1 1 1 1 1 1 1 1 1 1 1 1 1
symmnumber: 1
zpe: 1032103.4 jmol-1
zpe.correction: 0.393107 hartree
zpe.thermalcorrener: 0.417197 hartree
zpe.thermalcorrenthalpy: 0.418142 hartree
zpe.thermalcorrgfe: 0.338284 hartree
zpe.sumelectzpe: -979.639785 hartree
zpe.sumelectthermal: -979.615696 hartree
zpe.sumelectthermalent: -979.614751 hartree
zpe.sumelectthermalfe: -979.694608 hartree
dipole: -3.4322 1.8452 -1.6141
dipole: 4.2178
quadrupole: -122.7559 -126.8738 -134.6506
quadrupole: 24.6490 -1.6543 3.6656
quadrupole: 5.3375 1.2197 -6.5572 24.6490 -1.6543 3.6656
hfenergy: -980.0328929 hartree
pointgroup: C01 [X(C18H25N1O3)]
dipole: 1.4919797 -0.5777412 -0.4403398 debye
polarizability: 275.3650165|12.2244609|247.6099558|3.0083467|19.0650897|145.8948426 unknown
InChI: InChI=1S/C18H25NO3/c1-6-15-12(4)17(20)13-9-10-16(21-5)14(18(13)22-15)11-19(7-2)8-3/h9-10H,6-8,11H2,1-5H3
charge 0 multiplicity 1
47 atoms
O  -0.928424 -0.885969 -0.584615
O  3.029619 1.790274 -0.411025
O  -3.409776 2.332795 0.346034
N  2.062303 -1.684234 0.407746
C  1.88735 -0.783005 -0.77261
C  1.055397 0.449356 -0.455824
C  -0.354619 0.373408 -0.348372
C  -1.178996 1.487778 -0.042203
C  2.985713 -1.113328 1.425881
C  2.435145 -3.062133 -0.011364
C  1.63384 1.733929 -0.273551
C  -2.321657 -1.052296 -0.4893
C  -3.180969 -0.018025 -0.17835
C  -2.649649 1.342038 0.065233
C  -0.550472 2.742935 0.149795
C  0.838242 2.877558 0.030184
C  -2.69372 -2.479133 -0.801563
C  2.779097 -1.721106 2.826306
C  1.23542 -3.882653 -0.523444
C  -4.680099 -0.217175 -0.075178
C  -2.59749 -2.79972 -2.318647
C  3.688433 3.092066 -0.269277
H  1.363095 -1.36367 -1.55089
H  2.868501 -0.461554 -1.190611
H  4.057075 -1.221147 1.115081
H  2.789688 -0.028432 1.47975
H  3.243773 -3.048172 -0.787504
H  2.859244 -3.577928 0.868767
H  -1.192524 3.597242 0.387076
H  1.301042 3.8575 0.173523
H  -2.01034 -3.148783 -0.246107
H  -3.717731 -2.672166 -0.441224
H  1.73185 -1.58081 3.145953
H  3.001605 -2.803512 2.851814
H  3.443952 -1.228159 3.560416
H  0.468448 -3.956454 0.267287
H  0.762747 -3.417597 -1.407416
H  1.557158 -4.902318 -0.807975
H  -4.952373 -0.86658 0.777869
H  -5.10962 -0.662524 -0.990765
H  -5.145652 0.76914 0.087351
H  -2.853293 -3.858027 -2.503976
H  -1.573295 -2.621371 -2.689565
H  -3.290438 -2.168729 -2.903332
H  4.7562 2.887809 -0.435626
H  3.542621 3.510099 0.745082
H  3.323476 3.812082 -1.026332
