program: Gaussian 09
title: 000049409
version: EM64L-G09RevD.01
frameworkgroup: C1[X(C21H25NO)]
method: RPBEPBE
basis: SDD
operation: Freq
keyword: #p
keyword: freq=noraman
keyword: PBEPBE/SDD
title: #p freq=noraman PBEPBE/SDD
converged: YES YES NO NO
title: Mulliken charges:
elementType: O N C C C C C C C C C C C C C C C C C C C C C H H H H H H H H H H H H H H H H H H H H H H H H H
charge: -0.470668 -0.071008 -0.050915 -0.561830 0.102449 -0.494061 -0.417515 -0.382222 0.187472 0.199489 0.290992 0.336350 -0.577476 -0.634145 -0.631304 -0.374864 -0.384788 -0.408221 -0.445255 -0.266859 -0.254044 -0.252090 -0.242708 0.273338 0.219702 0.241371 0.224654 0.217930 0.250652 0.174869 0.174950 0.220314 0.218902 0.242275 0.216861 0.222047 0.220229 0.181476 0.224424 0.343104 0.288588 0.272371 0.231354 0.233333 0.228076 0.227151 0.228887 0.226364
chargesum: 0.00000
title: Mulliken charges with hydrogens summed into heavy atoms:
elementType: O N C C C C C C C C C C C C C C C C C C C C C
charge: -0.127564 -0.071008 0.222423 -0.100756 0.102449 -0.051477 0.008006 0.013041 0.187472 0.199489 0.290992 0.336350 -0.116299 -0.195237 -0.005175 -0.086275 -0.112417 -0.176867 -0.211922 -0.038783 -0.026893 -0.023203 -0.016343
polarizability: 2.47804904e+02 -1.82953269e+01 2.51238210e+02 2.59882216e+01 1.04020027e+01 1.80287035e+02
1716.lowfreq: -9.7487 -3.6513 -0.0004 -0.0004 0.0002 11.1935 17.6839 39.3275 48.5954
frequency: 17.2434 39.2052 48.4579 57.7332 72.2285 98.3221 111.8206 135.8557 160.3002 169.1216 218.6687 238.4282 241.3151 265.3235 283.7131 300.1623 304.6776 311.7543 339.3479 349.7115 370.8197 396.7265 424.4444 435.7693 449.6743 473.6355 507.4064 515.8024 534.0372 552.0384 566.3045 585.8075 611.1159 619.5546 645.5285 669.7424 736.6930 760.9374 766.4287 769.1025 776.1031 785.7812 799.3819 820.1249 852.8552 865.5658 879.4779 887.0761 908.4894 927.0176 935.5862 957.1797 961.9378 969.1346 972.4250 974.3950 995.2109 995.9091 1002.1299 1028.8880 1043.9973 1053.6019 1060.7805 1065.6425 1082.4188 1097.6496 1106.0775 1111.9553 1126.7085 1146.6870 1159.3899 1160.5436 1165.9249 1175.4677 1176.6523 1186.1688 1198.1119 1211.3933 1216.2948 1220.3841 1231.4885 1243.9156 1255.0883 1268.4947 1275.5801 1282.1815 1290.4731 1293.4588 1313.1651 1327.2044 1330.5313 1344.5721 1357.7389 1359.5684 1375.4246 1378.8211 1426.1489 1430.7394 1432.2920 1442.3836 1456.0294 1463.5468 1471.5168 1472.6098 1477.4323 1478.1421 1480.5606 1489.4843 1496.2194 1581.2992 1588.7952 1605.9389 1609.6990 2830.0059 2830.7164 2850.5903 2967.4396 2987.1679 2994.8508 2999.0845 3011.6307 3014.8255 3020.7398 3026.1103 3046.0532 3050.3379 3064.6951 3069.7817 3073.9378 3111.5373 3115.8848 3130.3046 3131.7509 3149.9495 3153.2378 3164.3280 3170.6005 3530.1928
redmass: 3.7049 3.9086 2.7753 4.3694 2.6725 3.8275 3.1924 2.5505 3.2663 3.5524 3.5470 1.4166 1.9695 3.4808 3.7985 3.0420 4.5294 2.6920 2.7892 2.6513 2.3732 1.7315 1.9225 3.3760 2.8490 2.9338 3.5729 4.0709 3.8512 3.9389 4.3236 2.9594 4.5666 4.0823 4.5311 4.9261 3.1560 3.1619 1.5158 1.3766 3.4629 2.9759 1.5453 2.3949 3.9758 2.5634 1.3372 1.4603 2.3184 2.3819 2.6920 1.7194 1.7404 1.9467 1.8163 1.7794 1.3286 1.3204 2.0133 2.4154 2.8090 2.4510 2.4564 2.1212 2.1230 2.4940 1.4055 2.0505 2.2196 2.0275 1.3310 1.8352 1.2866 1.0716 1.1222 1.6283 1.7864 1.8027 1.8588 1.9143 1.4802 1.5309 1.4146 1.3953 1.3680 1.5141 1.3215 1.2161 1.3622 1.6296 1.4438 1.4535 1.6200 2.8192 2.3307 5.2357 2.0950 1.1830 1.8288 1.2361 1.1847 1.0553 1.0786 1.0781 1.2066 1.6532 2.3267 1.1638 1.0958 6.7617 6.9513 6.1288 6.2369 1.0675 1.0664 1.0672 1.0625 1.0603 1.0626 1.0622 1.0720 1.0868 1.0846 1.0958 1.1010 1.0996 1.0985 1.1007 1.0928 1.0873 1.0868 1.0882 1.0891 1.0937 1.0958 1.0989 1.0960 1.0654
irintensity: 0.1196 0.0530 0.3376 0.1889 0.1023 0.1191 1.2620 1.4143 0.4183 0.7117 0.2002 1.4550 0.1236 0.8498 2.6773 1.4064 2.6030 14.0937 4.7457 2.2333 20.5857 135.4866 6.2547 4.0641 7.1675 4.5727 3.9469 0.1464 2.1587 3.5677 1.7928 5.9947 11.9412 25.6136 4.3912 9.0537 2.4862 2.2565 24.1963 82.8361 0.2294 22.4925 2.1610 6.4260 21.1879 5.9504 0.9638 1.2533 12.5236 3.3385 22.3482 1.0029 13.7904 2.6454 3.1039 3.0599 0.7505 0.9535 21.0027 23.9458 5.5809 6.3295 7.2591 11.5057 6.3227 0.6663 11.7934 2.2917 0.7397 2.6008 1.0348 38.2781 0.8641 1.5106 0.7060 1.2332 2.2688 2.6505 8.7601 5.2963 3.3311 13.8891 9.7970 5.1721 28.4952 31.9020 2.8632 13.4386 3.0448 0.0933 10.7287 2.7158 0.8065 1.1396 2.3606 0.8980 8.5447 0.0107 7.7845 2.1911 14.7797 24.1909 3.7327 6.2126 9.7131 26.9781 6.7728 22.3270 8.0773 2.0290 0.3227 0.5648 0.9947 93.6418 53.7536 223.6719 22.6174 8.6522 18.6646 50.4860 45.3028 53.4092 8.5005 45.4754 47.0319 5.4487 34.2706 32.5696 45.6663 9.9875 7.3848 11.7958 14.6290 22.2667 27.0117 28.4919 17.6430 8.6262
temp: 298.150 k
press: 1.00000 atm
elementType: 8 7 6 6 6 6 6 6 6 6 6 6 6 6 6 6 6 6 6 6 6 6 6 1 1 1 1 1 1 1 1 1 1 1 1 1 1 1 1 1 1 1 1 1 1 1 1 1
symmnumber: 1
zpe: 1070907.6 jmol-1
zpe.correction: 0.407887 hartree
zpe.thermalcorrener: 0.428285 hartree
zpe.thermalcorrenthalpy: 0.429229 hartree
zpe.thermalcorrgfe: 0.358414 hartree
zpe.sumelectzpe: -943.499902 hartree
zpe.sumelectthermal: -943.479504 hartree
zpe.sumelectthermalent: -943.478560 hartree
zpe.sumelectthermalfe: -943.549375 hartree
dipole: 1.8849 0.0304 0.5221
dipole: 1.9561
quadrupole: -134.2239 -130.0279 -132.3125
quadrupole: 2.1819 3.8758 2.2326
quadrupole: -2.0358 2.1602 -0.1244 2.1819 3.8758 2.2326
hfenergy: -943.9077889 hartree
pointgroup: C01 [X(C21H25N1O1)]
dipole: -0.7294347 -0.1216531 0.2130195 debye
polarizability: 252.8323357|-18.2533924|245.5898904|-24.7276946|-14.3594748|180.9079235 unknown
InChI: InChI=1S/C21H25NO/c1-22-13-12-16(15-22)14-21(23)19-8-4-2-6-17(19)10-11-18-7-3-5-9-20(18)21/h2-9,16,23H,10-15H2,1H3
charge 0 multiplicity 1
48 atoms
O  0.120746 0.804236 -1.73654
N  4.206312 1.326233 -0.020136
C  2.029176 0.639385 0.599931
C  0.5138 0.926505 0.63618
C  -0.375775 0.231887 -0.451484
C  2.748435 1.17161 1.889303
C  2.819653 1.320198 -0.54213
C  4.104842 1.757971 1.397821
C  -1.849104 0.731904 -0.281132
C  -0.117414 -1.298493 -0.472124
C  -2.943476 0.063259 0.350945
C  -0.577318 -2.181887 0.54919
C  -2.901813 -1.315752 1.005242
C  -1.547806 -1.731602 1.624537
C  5.181368 2.073859 -0.822089
C  -2.077246 2.046892 -0.79009
C  0.724854 -1.824965 -1.48611
C  -4.206882 0.718908 0.398848
C  -0.192468 -3.54579 0.513951
C  -3.332109 2.67947 -0.728554
C  1.09195 -3.187813 -1.517795
C  -4.419743 2.002413 -0.135057
C  0.635202 -4.059246 -0.507275
H  2.201453 -0.44924 0.527032
H  0.117655 0.630076 1.62577
H  0.342606 2.016887 0.545673
H  2.888608 0.358833 2.622838
H  2.142194 1.958209 2.376755
H  2.758237 0.773635 -1.496628
H  2.423085 2.354891 -0.717946
H  4.090482 2.87581 1.484549
H  4.973552 1.391576 1.975703
H  -3.67632 -1.333668 1.795545
H  -3.196758 -2.089916 0.267436
H  -1.719849 -2.5689 2.325522
H  -1.148906 -0.893737 2.22653
H  6.191877 1.962708 -0.387477
H  4.954494 3.170649 -0.885486
H  5.208899 1.67162 -1.85088
H  -0.517866 0.541638 -2.450005
H  -1.234788 2.569147 -1.253051
H  1.114531 -1.143095 -2.246251
H  -5.041903 0.194666 0.880841
H  -0.557062 -4.214425 1.303631
H  -3.457242 3.688643 -1.136443
H  1.742056 -3.557427 -2.318654
H  -5.409096 2.469592 -0.077068
H  0.918977 -5.117551 -0.510567
