program: Gaussian 09
title: 000049402
version: EM64L-G09RevD.01
frameworkgroup: C1[X(C22H27N)]
method: RPBEPBE
basis: SDD
operation: Freq
keyword: #pfreq=noraman
keyword: PBEPBE/SDD
title: #p freq=noraman PBEPBE/SDD
converged: YES YES NO NO
title: Mulliken charges:
elementType: N C C C C C C C C C C C C C C C C C C C C C C H H H H H H H H H H H H H H H H H H H H H H H H H H H
charge: -0.095947 0.329201 -0.440704 -0.341321 0.167215 -0.764026 -0.777149 0.150822 0.198619 -0.547834 -0.630901 0.268387 0.335445 -0.397469 -0.417096 -0.361832 -0.441585 -0.642249 -0.636851 -0.255494 -0.259912 -0.256442 -0.238681 0.218289 0.218022 0.227392 0.245739 0.194939 0.214739 0.205999 0.231940 0.239178 0.235416 0.221896 0.229036 0.211356 0.249871 0.238157 0.230473 0.236481 0.245196 0.190848 0.221116 0.233772 0.220439 0.192361 0.225924 0.227175 0.226277 0.223772
chargesum: 0.00000
title: Mulliken charges with hydrogens summed into heavy atoms:
elementType: N C C C C C C C C C C C C C C C C C C C C C C
charge: -0.095947 0.329201 -0.004392 -0.113929 0.167215 -0.108609 -0.100032 0.150822 0.198619 -0.090522 -0.190509 0.268387 0.335445 -0.147598 -0.178940 -0.131360 -0.205103 0.014911 0.009721 -0.029570 -0.032737 -0.030165 -0.014909
polarizability: 2.90282915e+02 4.78124910e+00 2.59126529e+02 -1.48615763e+01 8.58224348e+00 1.84830011e+02
1716.lowfreq: -4.6753 -0.0005 -0.0002 0.0003 5.4230 7.0924 21.8228 43.5771 49.9684
frequency: 21.7351 43.5213 49.9512 51.9408 63.6526 84.4872 87.4647 110.3819 154.8375 166.3290 181.7730 201.7741 215.7553 223.0436 241.4220 254.2497 259.1239 273.4963 294.3590 301.9914 306.9382 323.6830 347.8003 373.0856 408.2822 430.9091 435.1288 446.3947 458.7268 461.4810 482.1941 519.1678 538.2338 560.6329 586.0726 600.6436 640.7526 660.1973 694.6551 718.5677 729.9998 745.5004 763.8579 773.8410 774.9897 793.0769 820.2094 863.7059 873.6119 876.1589 890.2818 894.1339 914.0036 928.0961 939.3405 951.1739 951.8695 972.2073 981.8969 983.5268 985.7999 1014.3113 1026.5376 1038.0006 1039.2806 1040.4394 1052.5719 1086.4471 1089.0133 1104.4307 1115.7580 1133.2574 1156.5284 1164.8274 1172.1625 1172.9939 1181.6212 1189.6138 1207.1028 1216.1851 1222.0646 1236.1744 1256.3961 1271.4339 1283.3234 1285.7892 1325.1740 1326.9673 1339.7894 1350.1819 1363.4274 1367.9498 1374.5021 1377.9280 1391.2145 1420.3834 1427.0020 1436.2905 1438.9644 1447.5210 1459.5081 1463.8389 1465.7862 1469.6338 1470.5575 1475.1072 1478.0136 1479.9012 1481.9708 1483.9833 1486.2602 1497.5010 1575.4582 1581.6337 1601.9140 1608.8997 1628.5743 2845.5399 2856.4803 2943.9383 2959.9702 2966.3454 2982.4710 2985.6689 3005.0537 3011.0225 3013.2014 3016.7668 3047.1200 3058.7618 3061.8025 3071.9489 3076.5561 3084.4735 3085.6618 3096.5246 3107.5308 3115.1663 3124.4426 3125.5101 3139.4087 3140.0647 3158.6864 3159.3008
redmass: 3.6772 3.8599 3.0384 3.9906 2.6378 3.6105 3.9244 3.8594 3.1574 2.5028 2.4147 2.4234 1.4222 1.0649 2.1802 1.2571 2.8470 3.4004 1.2352 2.8461 2.9454 4.1027 3.1884 2.5610 2.3461 2.6698 1.8120 3.3654 2.9054 3.0875 3.4962 3.9765 3.9827 3.4929 3.0374 4.0516 4.5825 4.9895 4.4796 3.1655 4.0948 1.8019 1.6660 2.3196 2.3277 3.4819 3.7951 1.4063 1.8755 1.5655 2.1292 1.7934 2.3049 1.9808 1.4176 1.4559 1.6174 2.2278 1.7023 1.3785 1.3560 1.4469 2.7579 2.1549 2.2577 1.5480 2.2863 2.3134 1.2514 1.9964 1.8428 1.4033 2.1797 1.1613 1.0698 1.1198 2.1560 2.0568 2.2613 1.5957 1.8134 2.4238 1.8736 2.6554 1.8688 1.4858 1.5063 1.5369 1.3071 2.1057 1.2225 2.0522 4.1137 1.8619 1.3195 1.1369 2.2248 1.1276 2.2231 1.1870 1.0546 1.0943 1.0618 1.0696 1.1148 1.0920 1.9705 1.6954 1.3430 1.0787 1.0792 1.0537 6.5314 6.7351 6.2028 6.4473 9.0930 1.0571 1.0572 1.0571 1.0603 1.0361 1.0362 1.0647 1.1044 1.0951 1.0732 1.0732 1.1019 1.0946 1.0909 1.0991 1.0996 1.0995 1.0991 1.0987 1.0875 1.0864 1.0868 1.0878 1.0933 1.0937 1.1006 1.1008
irintensity: 0.1550 0.0746 0.1105 0.6237 0.0738 0.1155 0.1180 0.1275 1.2720 2.4614 0.5010 0.0407 1.3152 0.2450 0.2845 0.0823 1.9890 0.6071 2.9737 7.5091 0.7400 0.7313 0.2464 0.7702 0.8617 2.8226 0.0828 3.0315 0.8193 3.4521 4.0219 0.2939 0.2540 6.1393 3.0502 10.6269 9.8352 0.7416 4.0039 1.9672 0.9954 31.8032 39.5913 31.5811 47.0647 8.7918 12.6812 4.6694 26.7741 3.4794 6.6178 4.0184 6.5344 12.9293 1.4557 1.1794 4.4431 3.2594 2.7890 1.0431 0.1026 1.6694 5.1818 55.0674 66.3373 23.2237 4.7453 8.1511 3.4296 6.2680 11.9361 5.3471 5.5608 2.7912 0.7747 0.8188 2.9873 0.8373 7.6904 3.0359 2.6912 5.6910 3.3570 31.2796 0.6846 2.0609 0.8681 8.6517 1.1920 0.8507 18.0342 1.2907 2.9757 12.9764 17.1378 3.5012 8.5625 4.2477 1.6595 11.7314 1.2697 2.1777 5.4568 15.5385 8.4896 38.4695 2.9840 25.6608 10.4162 2.7851 4.0131 32.2350 1.3029 0.7663 1.1247 2.2335 3.2007 70.0344 243.7004 51.1599 29.3319 31.9343 20.2646 20.1794 28.9793 41.5174 31.0382 62.1405 30.2980 19.9310 38.9813 26.7550 40.1694 57.3152 4.4932 23.9883 13.5751 7.6344 3.1284 4.0600 16.5017 43.3630 42.4255 26.0382
temp: 298.150 k
press: 1.00000 atm
elementType: 7 6 6 6 6 6 6 6 6 6 6 6 6 6 6 6 6 6 6 6 6 6 6 1 1 1 1 1 1 1 1 1 1 1 1 1 1 1 1 1 1 1 1 1 1 1 1 1 1 1
symmnumber: 1
zpe: 1123135.8 jmol-1
zpe.correction: 0.427780 hartree
zpe.thermalcorrener: 0.450094 hartree
zpe.thermalcorrenthalpy: 0.451038 hartree
zpe.thermalcorrgfe: 0.376508 hartree
zpe.sumelectzpe: -907.568330 hartree
zpe.sumelectthermal: -907.546016 hartree
zpe.sumelectthermalent: -907.545072 hartree
zpe.sumelectthermalfe: -907.619602 hartree
dipole: 0.3240 0.1956 -0.3146
dipole: 0.4922
quadrupole: -128.6679 -131.1788 -138.8976
quadrupole: -2.7657 -8.4490 3.0776
quadrupole: 4.2468 1.7360 -5.9828 -2.7657 -8.4490 3.0776
hfenergy: -907.9961094 hartree
pointgroup: C01 [X(C22H27N1)]
dipole: 0.1383727 0.0341732 -0.1310678 debye
polarizability: 291.0256885|-2.6127242|259.9482657|-12.9001118|-1.7103918|183.2655013 unknown
InChI: InChI=1S/C22H27N/c1-22(2,16-23(3)4)15-21-19-11-7-5-9-17(19)13-14-18-10-6-8-12-20(18)21/h5-12,15H,13-14,16H2,1-4H3
charge 0 multiplicity 1
50 atoms
N  4.277876 -1.354225 0.063133
C  1.956122 -0.870653 1.047558
C  2.816325 -1.381729 -0.175723
C  0.477389 -1.088587 0.713288
C  -0.465062 -0.291802 0.114899
C  2.296527 -1.751044 2.283827
C  2.334822 0.592919 1.390057
C  -1.867276 -0.826379 -0.04641
C  -0.22576 1.082731 -0.440478
C  -3.090013 1.299909 0.937491
C  -1.752315 1.948942 1.376507
C  -3.047437 -0.09834 0.306255
C  -0.842722 2.200577 0.189415
C  -2.014162 -2.131248 -0.603423
C  0.548737 1.284968 -1.609402
C  -4.311378 -0.711074 0.088138
C  -0.634068 3.497847 -0.334772
C  5.005398 -0.317162 -0.690774
C  4.940553 -2.669441 0.015048
C  -3.275685 -2.722373 -0.807733
C  0.745332 2.583132 -2.132717
C  -4.441111 -2.002157 -0.459795
C  0.160751 3.696425 -1.48756
H  2.495136 -2.417935 -0.410825
H  2.559971 -0.763256 -1.060968
H  0.106595 -2.072344 1.045554
H  3.380502 -1.692581 2.485852
H  2.027212 -2.811777 2.113092
H  1.748637 -1.400335 3.177915
H  1.722424 0.965279 2.232225
H  3.396623 0.621532 1.694421
H  2.194059 1.280652 0.540691
H  -3.586305 1.986601 0.220704
H  -3.757681 1.249372 1.821178
H  -1.250619 1.289256 2.110684
H  -1.981312 2.900413 1.891671
H  -1.108863 -2.671002 -0.902965
H  0.984632 0.417946 -2.117981
H  -5.215055 -0.153361 0.367571
H  -1.098669 4.358024 0.163166
H  4.517998 0.662378 -0.552062
H  5.059303 -0.523034 -1.790641
H  6.041247 -0.236566 -0.311631
H  4.42176 -3.378052 0.683678
H  5.983693 -2.57453 0.370219
H  4.969877 -3.119374 -1.010332
H  -3.349399 -3.7245 -1.244672
H  1.347069 2.722708 -3.037857
H  -5.434031 -2.438874 -0.614763
H  0.314354 4.706923 -1.88285
