program: Gaussian 09
title: 000002280
version: EM64L-G09RevD.01
frameworkgroup: C1[X(C17H16N8O)]
method: RPBEPBE
basis: SDD
operation: Freq
keyword: #p
keyword: freq=noraman
keyword: PBEPBE/SDD
title: #p freq=noraman PBEPBE/SDD
converged: YES YES NO NO
title: Mulliken charges:
elementType: O N N N N N N N N C C C C C C C C C C C C C C C C C H H H H H H H H H H H H H H H H
charge: -0.201255 -0.434795 -0.434778 0.057644 0.057613 -0.593484 -0.593488 -0.589873 -0.589888 0.311991 0.311988 0.007457 0.007455 0.103610 0.103617 -0.017378 -0.507161 -0.507138 0.391859 0.391904 -0.304138 -0.304168 -0.386875 -0.386873 0.325074 0.325079 0.368644 0.368646 0.278728 0.278716 0.290383 0.290383 0.268947 0.268926 0.370748 0.388080 0.370747 0.388079 0.391502 0.370987 0.391500 0.370985
chargesum: 2.00000
title: Mulliken charges with hydrogens summed into heavy atoms:
elementType: O N N N N N N N N C C C C C C C C C C C C C C C C C
charge: -0.201255 -0.066150 -0.066131 0.057644 0.057613 0.165345 0.165337 0.172616 0.172597 0.311991 0.311988 0.007457 0.007455 0.103610 0.103617 -0.017378 -0.228433 -0.228422 0.391859 0.391904 -0.013756 -0.013785 -0.117928 -0.117947 0.325074 0.325079
polarizability: 5.94753478e+02 2.43038145e-03 2.38290226e+02 1.82307973e+00 1.97138016e-02 1.05775456e+02
1716.lowfreq: -3.4355 -1.9318 -0.0009 0.0010 0.0013 9.0628 19.6689 20.3517 38.0190
frequency: 19.5855 20.1663 38.0181 60.9342 76.5972 90.8512 105.2905 115.0537 130.1947 135.5214 150.8443 212.8599 219.3007 265.3415 272.3333 284.0595 301.8233 324.8323 342.1491 386.4444 412.7816 425.4021 439.7368 440.1377 471.0772 473.3252 483.9470 495.8496 551.3664 556.1967 577.3427 580.6195 591.1934 594.1385 626.8542 649.3146 649.5395 654.6133 683.7776 684.0487 687.8485 694.0835 694.5073 727.1667 729.6060 739.6272 740.8477 745.8703 747.0013 777.9713 778.1004 795.6310 802.3129 821.3745 846.1683 846.9864 865.1185 893.1320 893.5034 932.2242 933.5260 951.2623 982.1566 982.3098 1022.8082 1054.1486 1054.1786 1069.8886 1069.9864 1125.3180 1125.7780 1134.7433 1136.4196 1179.6660 1233.2163 1233.7810 1237.7651 1268.3435 1272.6344 1289.9007 1310.8930 1339.5067 1339.7776 1379.7269 1380.9001 1425.6291 1430.1133 1467.2676 1469.0460 1484.7140 1513.0564 1519.8732 1528.1151 1530.9976 1563.4922 1566.8582 1582.1766 1583.8206 1630.2330 1632.0618 1671.6515 1671.9844 1672.8281 1673.5145 3147.6816 3147.7161 3150.0300 3150.0671 3187.5583 3187.5944 3502.3871 3502.4323 3511.5785 3511.9923 3551.3443 3551.9864 3637.7119 3637.7512 3641.9136 3641.9744
redmass: 4.5357 6.2229 6.5527 5.4549 4.6259 4.1113 5.2606 6.3100 7.1496 5.5930 6.2550 5.0808 5.1117 4.5171 4.7451 6.0277 6.6643 5.9533 5.6046 5.4282 4.2662 3.4852 4.2824 3.1633 1.5149 1.1274 1.9070 3.7180 2.7396 3.1182 4.3995 3.0983 2.7583 6.7767 3.9441 1.3603 1.2941 4.9080 1.2778 1.2789 5.3916 2.1276 2.0903 4.7085 3.9456 1.4201 1.4267 1.5902 1.8628 3.5211 3.6077 5.8104 8.4345 5.3051 1.5537 1.5702 7.6648 1.5769 1.5774 3.8061 3.8026 9.8490 1.3520 1.3521 4.0254 1.3069 1.3070 2.2029 2.2012 1.8969 1.9119 1.6470 1.6245 1.7605 2.3961 2.2869 1.9184 3.2141 4.1293 2.0289 1.7837 7.3826 3.0452 4.2670 4.5011 3.5326 3.0221 3.7599 3.5508 5.7258 6.2351 10.2973 4.4515 4.4128 3.9655 3.3677 2.4077 2.7374 7.4065 7.3911 1.4019 1.6870 1.5543 1.3136 1.0911 1.0911 1.0929 1.0929 1.0967 1.0967 1.0479 1.0479 1.0498 1.0499 1.0822 1.0823 1.1036 1.1036 1.1035 1.1035
irintensity: 0.1676 19.0089 10.8837 0.0358 3.0306 0.0337 1.7677 6.9221 2.0751 0.7708 1.0032 12.0681 0.0343 0.6407 19.4911 1.9430 39.7012 1.3363 0.0028 18.0639 0.1058 21.2386 30.9813 0.0435 0.9125 41.8085 0.3280 15.3413 2.5930 0.4167 0.5947 14.1822 5.3062 1.3335 13.7184 17.9134 25.2771 2.5115 65.8445 6.2457 0.0316 94.7637 108.3979 34.6897 33.6190 21.0126 86.6803 646.9964 176.9319 0.0390 7.7164 45.6686 9.4899 1.0481 1.1118 68.5568 56.3684 0.8626 76.0229 0.1768 0.7890 1.1796 0.0205 2.8924 19.0640 2.7324 1.5531 4.8860 0.0598 1.0444 87.5443 2.0948 5.5869 5.6900 5.6217 3.7013 449.5493 74.5095 4.5565 1.3345 317.9799 58.0056 69.6299 0.0954 116.2259 13.7250 36.7676 541.8584 0.0516 0.0782 367.9793 161.6723 831.5022 1.2305 0.4568 15.1923 3.0463 13.0933 87.2072 2.8885 357.2456 342.4865 455.0079 106.1477 0.4489 0.6551 3.4779 0.2759 1.7061 0.5333 177.7081 190.2602 500.3329 3.4952 6.9671 231.9672 68.7531 62.0926 73.6010 61.5584
temp: 298.150 k
press: 1.00000 atm
elementType: 8 7 7 7 7 7 7 7 7 6 6 6 6 6 6 6 6 6 6 6 6 6 6 6 6 6 1 1 1 1 1 1 1 1 1 1 1 1 1 1 1 1
symmnumber: 1
zpe: 859758.1 jmol-1
zpe.correction: 0.327465 hartree
zpe.thermalcorrener: 0.348890 hartree
zpe.thermalcorrenthalpy: 0.349834 hartree
zpe.thermalcorrgfe: 0.275619 hartree
zpe.sumelectzpe: -1168.410404 hartree
zpe.sumelectthermal: -1168.388979 hartree
zpe.sumelectthermalent: -1168.388035 hartree
zpe.sumelectthermalfe: -1168.462250 hartree
dipole: -0.0002 0.8193 0.0099
dipole: 0.8194
quadrupole: 387.8220 -112.4823 -142.4331
quadrupole: -0.0012 1.4540 0.0087
quadrupole: 343.5198 -156.7845 -186.7353 -0.0012 1.4540 0.0087
hfenergy: -1168.7378687 hartree
pointgroup: C01 [X(C17H16N8O1)]
dipole: 0.0001411 -0.3223414 -0.0041602 debye
polarizability: 594.7578273|0.2352837|238.2902505|-1.0589393|0.1324865|105.7710831 unknown
InChI: InChI=1S/C17H16N8O/c18-14(19)7-1-3-9-11(5-7)24-16(22-9)13(26)17-23-10-4-2-8(15(20)21)6-12(10)25-17/h1-6,24-25H,18-21H2
charge 2 multiplicity 1
42 atoms
O  -0.000511 -2.63051 -0.000873
N  -2.464651 -1.421083 -0.016005
N  2.462066 -1.417887 0.013971
N  -1.554876 0.687634 -0.006457
N  1.549502 0.689695 0.009834
N  -7.807795 -0.708673 -0.699312
N  7.804885 -0.699924 0.695164
N  -7.962823 1.170611 0.691858
N  7.956254 1.183056 -0.691393
C  -3.544789 -0.548819 -0.027419
C  3.541068 -0.544237 0.026757
C  -2.949906 0.774119 -0.016521
C  2.944419 0.77796 0.019286
C  -1.297356 -0.640418 -0.00721
C  1.293742 -0.638743 0.007555
C  -0.001353 -1.353683 -0.000178
C  -4.937223 -0.743675 -0.032227
C  4.933763 -0.737248 0.030106
C  -5.742401 0.426077 -0.019847
C  5.737385 0.433611 0.019912
C  -3.773897 1.926458 -0.011539
C  3.766887 1.931392 0.016423
C  -5.163143 1.742796 -0.009709
C  5.156369 1.74956 0.013267
C  -7.214017 0.291819 -0.009799
C  7.209185 0.301414 0.008532
H  -2.452419 -2.444032 -0.014786
H  2.451213 -2.44085 0.010946
H  -5.379222 -1.744175 0.020484
H  5.377071 -1.737026 -0.025251
H  -3.326923 2.923618 -0.020974
H  3.318643 2.927951 0.028469
H  -5.814623 2.621879 -0.061456
H  5.806663 2.629429 0.06665
H  -8.807821 -0.91267 -0.633866
H  -7.263396 -1.262326 -1.361379
H  8.805166 -0.902258 0.628537
H  7.26177 -1.256019 1.35623
H  -7.510466 1.83034 1.326251
H  -8.984031 1.195995 0.643701
H  7.502538 1.843848 -1.3237
H  8.977453 1.209791 -0.643832
