program: Gaussian 09
title: 000049399
version: EM64L-G09RevD.01
frameworkgroup: C1[X(C21H22ClN)]
method: RPBEPBE
basis: SDD
operation: Freq
keyword: #p
keyword: freq=noraman
keyword: PBEPBE/SDD
title: #p freq=noraman PBEPBE/SDD
converged: YES YES NO NO
title: Mulliken charges:
elementType: Cl N C C C C C C C C C C C C C C C C C C C C C H H H H H H H H H H H H H H H H H H H H H H
charge: -0.063958 -0.081404 -0.141704 -0.371027 0.133985 -0.304336 0.203414 0.181483 -0.722113 0.397070 0.384528 -0.366419 -0.399569 -0.420299 -0.447202 -0.616236 -0.622397 -0.418664 -0.436615 -0.121461 -0.257409 -0.250738 -0.248290 0.242597 0.186703 0.210693 0.251106 0.251189 0.197322 0.219916 0.278213 0.246960 0.212609 0.211232 0.221509 0.187421 0.227442 0.220513 0.235355 0.182911 0.244557 0.241313 0.231299 0.257399 0.231103
chargesum: 0.00000
title: Mulliken charges with hydrogens summed into heavy atoms:
elementType: Cl N C C C C C C C C C C C C C C C C C C C C C
charge: -0.063958 -0.081404 0.100893 0.026369 0.133985 -0.053230 0.203414 0.181483 -0.053686 0.397070 0.384528 -0.088205 -0.152610 -0.207690 -0.235970 0.020135 0.016382 -0.174107 -0.195303 -0.121461 -0.026109 0.006661 -0.017187
polarizability: 3.16799916e+02 -3.32903582e+01 2.90887154e+02 2.99238507e+01 1.09406604e+01 1.74123415e+02
1716.lowfreq: -7.6330 -3.6157 -0.0021 -0.0020 -0.0011 3.0235 26.8449 29.7179 31.5459
frequency: 26.3473 29.7061 31.5157 48.1576 66.6971 79.0748 95.0032 111.1489 130.6133 162.2157 180.1745 207.3775 210.7475 217.2922 225.0987 240.7960 253.8641 290.7782 305.8577 311.0286 341.3726 366.7575 374.7320 388.0898 410.3140 416.8163 435.6798 458.6022 483.9830 497.1092 505.3810 545.8704 579.5843 589.8663 618.0436 636.0628 674.6142 687.9059 722.1613 725.5347 749.9695 772.2349 796.1536 799.7640 816.8714 836.5378 848.9592 866.1522 884.9237 887.6773 901.4017 910.7455 933.4140 947.1366 952.4352 956.4361 983.5130 990.4451 1031.5485 1037.7010 1042.0859 1077.3733 1083.0350 1083.8380 1092.4558 1100.3007 1124.3397 1137.2727 1147.1717 1161.8441 1172.8660 1177.2909 1189.7752 1223.3434 1241.3092 1246.7451 1259.0049 1264.0521 1277.3138 1286.8157 1305.0972 1318.9065 1352.2541 1358.7789 1371.6494 1375.4311 1379.2843 1387.1874 1413.5390 1419.1730 1440.6576 1449.3309 1460.0524 1462.5255 1466.2849 1471.5574 1473.8740 1476.7728 1481.7453 1484.4347 1485.3619 1553.6929 1565.2655 1586.4245 1601.2725 1630.7540 1636.8765 2821.0208 2839.1381 2858.9352 2973.2397 2999.1616 3017.4156 3018.5355 3027.4359 3066.7868 3072.3780 3076.8016 3084.6936 3086.0280 3091.8601 3112.7380 3120.1618 3129.1989 3131.4530 3143.5757 3162.1463 3163.5763 3173.2580
redmass: 3.0582 5.3944 3.5661 4.7931 3.2643 4.1244 4.4136 3.2186 5.7359 4.1492 2.7367 3.8640 1.1333 1.4673 2.3455 1.1715 4.4423 4.5279 5.8808 2.6984 4.4873 4.0644 1.9589 3.8639 3.2565 3.3485 3.6494 2.6573 3.5238 3.6430 3.5609 5.0007 3.7890 3.6959 4.8644 5.3772 5.1502 5.3446 3.8610 2.1013 3.1746 1.7671 1.8202 3.4220 3.8522 1.6676 3.0336 2.1027 1.6278 1.6673 1.4788 1.4387 3.7520 1.7224 1.4006 1.4125 1.3311 1.3339 1.9194 1.6766 2.3794 2.5273 1.7294 2.0120 1.7683 2.3180 1.7554 1.6075 1.8805 2.0657 1.2376 1.6023 2.1186 2.1442 1.5814 1.5587 2.1555 1.5155 1.4608 1.4688 1.5149 1.3644 1.5651 1.3880 10.1155 1.3006 5.0402 2.4069 1.7035 1.1406 1.1508 2.1786 1.0771 1.0528 1.0649 2.4404 1.0705 1.0681 1.1428 2.4270 1.0560 8.0776 6.8437 6.6582 6.0513 8.4038 7.1975 1.0697 1.0577 1.0578 1.0364 1.0841 1.0738 1.0846 1.0711 1.0931 1.0929 1.1005 1.1004 1.0838 1.1005 1.0943 1.0865 1.0881 1.0895 1.0939 1.1007 1.0922 1.0958
irintensity: 0.2941 0.1569 0.1355 0.4839 0.3169 0.3376 0.1809 0.5627 0.1981 0.7960 2.1756 1.2036 0.0784 1.3217 0.3177 0.1474 0.3571 0.7459 1.9031 8.9346 1.8464 4.6442 1.2187 6.2359 3.3369 4.0298 2.1718 4.0856 7.8484 1.7522 14.9817 7.8918 4.0661 3.1512 5.2679 2.0777 9.4449 0.2018 4.7174 12.9150 1.0177 47.1285 6.8158 29.1924 26.5358 51.4336 8.4615 19.1661 19.2817 5.8495 4.5870 4.1138 28.9228 29.0444 1.3075 8.3920 0.9224 0.6872 66.4209 17.3208 14.7513 1.8589 11.5238 11.3593 27.4779 0.4954 3.7711 6.0353 5.0922 1.2188 0.7040 5.3257 11.0571 1.1209 0.9158 2.3254 8.8211 3.0368 3.0980 9.5212 4.6745 2.6222 1.9593 5.3245 2.1054 20.8849 6.2257 15.2924 5.4069 2.3508 1.0140 5.3454 5.6576 15.6773 1.7073 30.0045 26.6066 23.1117 20.8469 23.9084 14.9999 15.8732 1.9466 39.2722 0.6092 1.8560 2.7299 77.7841 75.9145 210.3067 28.7364 8.3451 32.5809 35.2166 40.2548 6.9757 33.9917 42.1373 53.9671 0.1157 16.6598 30.0711 11.1420 2.8249 15.5912 24.6910 32.5046 1.1098 5.8875
temp: 298.150 k
press: 1.00000 atm
elementType: 17 7 6 6 6 6 6 6 6 6 6 6 6 6 6 6 6 6 6 6 6 6 6 1 1 1 1 1 1 1 1 1 1 1 1 1 1 1 1 1 1 1 1 1 1
symmnumber: 1
zpe: 966295.3 jmol-1
zpe.correction: 0.368042 hartree
zpe.thermalcorrener: 0.389818 hartree
zpe.thermalcorrenthalpy: 0.390762 hartree
zpe.thermalcorrgfe: 0.315982 hartree
zpe.sumelectzpe: -1326.562940 hartree
zpe.sumelectthermal: -1326.541165 hartree
zpe.sumelectthermalent: -1326.540221 hartree
zpe.sumelectthermalfe: -1326.615000 hartree
dipole: -1.6310 1.7272 0.0296
dipole: 2.3758
quadrupole: -135.9503 -135.7034 -146.6919
quadrupole: 7.6675 13.1665 2.1384
quadrupole: 3.4982 3.7451 -7.2433 7.6675 13.1665 2.1384
hfenergy: -1326.9309827 hartree
pointgroup: C01 [X(C21H22Cl1N1)]
dipole: 0.5844229 -0.726725 0.0630556 debye
polarizability: 312.6069954|-36.1344364|295.0903038|-25.7092448|-15.701982|174.113186 unknown
InChI: InChI=1S/C21H22ClN/c1-15(14-23(2)3)12-21-19-7-5-4-6-16(19)8-9-17-10-11-18(22)13-20(17)21/h4-13,15H,14H2,1-3H3
charge 0 multiplicity 1
45 atoms
Cl -3.891545 3.546471 -1.458541
N  4.316072 1.804794 0.162637
C  2.072001 0.887547 0.932168
C  2.848031 1.855405 -0.014427
C  -0.269923 0.050553 0.167639
C  0.582928 0.998496 0.671823
C  -1.728086 0.377753 0.055053
C  0.195997 -1.282551 -0.330033
C  2.381104 1.217455 2.414924
C  -2.743818 -0.437581 0.656359
C  -0.329397 -2.513539 0.184096
C  -2.102119 1.584682 -0.593896
C  1.225899 -1.333672 -1.306768
C  -2.483436 -1.717901 1.324742
C  -1.449466 -2.601109 1.129494
C  4.990378 3.000925 -0.380808
C  4.920323 0.554858 -0.338324
C  -4.092656 0.025785 0.62853
C  0.257773 -3.740699 -0.24674
C  -3.447781 1.986871 -0.619162
C  1.769844 -2.558259 -1.747821
C  -4.462088 1.22655 -0.005113
C  1.291294 -3.772445 -1.20083
H  2.397916 -0.148639 0.725947
H  2.553225 1.640224 -1.076018
H  2.517406 2.890302 0.204195
H  0.132222 1.949922 0.998582
H  3.473953 1.247853 2.567529
H  1.970825 2.208296 2.691236
H  1.935839 0.464363 3.089214
H  -1.333099 2.19596 -1.074638
H  1.595897 -0.390947 -1.724411
H  -3.277675 -2.04391 2.011162
H  -1.512334 -3.551962 1.677505
H  6.069531 2.957581 -0.146529
H  4.885347 3.108153 -1.491048
H  4.575741 3.909607 0.090848
H  6.006937 0.564402 -0.139592
H  4.491789 -0.318531 0.182024
H  4.770298 0.407764 -1.439931
H  -4.869298 -0.581765 1.107523
H  -0.127933 -4.680206 0.167479
H  2.564132 -2.565136 -2.502331
H  -5.503189 1.560061 -0.025377
H  1.71484 -4.730281 -1.521871
