program: Gaussian 09
title: 000053456
version: EM64L-G09RevD.01
frameworkgroup: C1[X(C11H11N3O4)]
method: RPBEPBE
basis: SDD
operation: Freq
keyword: #p
keyword: freq=noraman
keyword: PBEPBE/SDD
title: #p freq=noraman PBEPBE/SDD
converged: YES YES NO NO
title: Mulliken charges:
elementType: O O O O N N N C C C C C C C C C C C H H H H H H H H H H H
charge: -0.203011 -0.141509 -0.158225 -0.225943 -0.166691 -0.098276 0.072704 0.465856 -0.341745 -0.360064 0.124896 -0.210041 -0.201981 -0.604727 -0.240425 0.018854 0.178250 -0.755983 0.273887 0.257234 0.237400 0.236520 0.250910 0.268279 0.290600 0.238712 0.262662 0.275692 0.256166
chargesum: 0.00000
title: Mulliken charges with hydrogens summed into heavy atoms:
elementType: O O O O N N N C C C C C C C C C C C
charge: -0.203011 -0.141509 -0.158225 -0.225943 -0.166691 -0.098276 0.072704 0.465856 -0.067858 -0.102830 0.124896 0.027359 0.034540 0.205061 -0.001713 0.018854 0.178250 0.038537
polarizability: 2.18762981e+02 -8.52139695e+00 1.55657598e+02 5.02254316e+00 1.25554153e+01 1.12056950e+02
1716.lowfreq: -5.1286 0.0004 0.0005 0.0007 0.0988 5.7975 30.4464 38.2550 43.8478
frequency: 30.4222 38.2385 43.8378 54.1253 58.7216 87.2733 99.6473 109.1783 118.1311 141.1827 187.1755 202.3989 248.1399 266.2668 283.8294 298.1868 327.7569 339.4963 374.5103 398.8489 403.8851 417.4657 467.7683 499.6645 533.7742 594.9659 611.7710 615.2792 669.3755 691.2673 718.6539 747.1248 764.5604 786.2165 816.3724 839.7899 919.2960 965.1283 968.5090 975.0987 987.3725 997.8262 1008.4398 1028.1622 1030.9972 1091.6046 1102.3785 1155.3537 1176.8084 1186.4835 1190.1882 1206.1821 1266.6298 1290.3124 1325.8965 1368.1299 1374.1041 1387.4288 1406.0627 1443.5069 1445.5597 1449.0084 1450.4646 1475.8155 1478.7805 1565.6486 1591.9617 1597.4443 1606.2842 1636.8325 2984.8661 2999.7216 3069.6762 3102.6327 3123.4206 3127.3996 3137.9851 3147.8592 3160.1218 3172.4417 3190.0270
redmass: 7.7079 4.6319 6.2018 5.4884 5.3617 5.3792 1.1057 5.1469 3.4713 1.2789 3.1016 8.3144 5.0167 6.4832 4.1501 8.4565 10.9394 5.9415 6.7566 4.8217 3.0290 4.8061 4.2176 6.4281 4.6879 7.2528 6.0624 4.8878 5.3591 2.1845 6.1958 3.0757 2.3658 4.6518 4.7851 1.2582 1.4062 2.3461 4.0867 1.4018 5.8103 1.3536 3.2169 2.1676 2.4244 1.5636 1.3532 3.5149 1.0555 2.4398 1.2234 2.8573 6.2349 6.4381 1.3941 5.5404 1.2296 9.7408 1.3065 1.0744 2.1391 1.0724 1.0862 1.0732 2.1246 10.7107 12.3286 6.7738 6.1742 9.3801 1.0369 1.0314 1.0961 1.1023 1.1015 1.1003 1.0855 1.0893 1.0941 1.0993 1.0969
irintensity: 0.9981 0.4403 0.3427 4.2491 5.8390 1.5532 0.4957 0.9877 4.1837 0.7968 8.1248 2.5597 5.7335 4.9215 4.8707 5.7396 2.1509 3.6543 2.0916 4.1339 1.6075 4.0702 16.0688 14.3098 4.8149 36.4781 0.2343 6.7953 4.4105 31.4625 14.1534 41.8920 48.9313 23.6070 60.9775 1.1254 3.0411 30.7067 36.8584 0.8480 4.5136 1.2553 100.5263 5.3396 38.7129 4.5308 3.3751 12.1959 0.2391 39.8045 0.3714 13.0621 50.8608 81.4428 1.7631 153.6840 68.4252 0.2561 48.2833 45.1119 13.7949 31.4002 16.8378 26.7019 37.6795 257.6872 98.0586 21.0151 15.5396 59.5018 0.3715 7.5462 2.0235 6.4736 0.9986 11.1752 0.4226 7.2477 17.2201 17.9190 1.5802
temp: 298.150 k
press: 1.00000 atm
elementType: 8 8 8 8 7 7 7 6 6 6 6 6 6 6 6 6 6 6 1 1 1 1 1 1 1 1 1 1 1
symmnumber: 1
zpe: 545803.1 jmol-1
zpe.correction: 0.207885 hartree
zpe.thermalcorrener: 0.225981 hartree
zpe.thermalcorrenthalpy: 0.226926 hartree
zpe.thermalcorrgfe: 0.159804 hartree
zpe.sumelectzpe: -889.490401 hartree
zpe.sumelectthermal: -889.472305 hartree
zpe.sumelectthermalent: -889.471361 hartree
zpe.sumelectthermalfe: -889.538483 hartree
dipole: 6.6354 0.9187 0.4576
dipole: 6.7143
quadrupole: -107.9488 -107.2924 -103.5650
quadrupole: 0.4474 -7.8303 -3.4967
quadrupole: -1.6800 -1.0237 2.7037 0.4474 -7.8303 -3.4967
hfenergy: -889.6982867 hartree
pointgroup: C01 [X(C11H11N3O4)]
dipole: 2.60622 0.3905376 -0.1821749 debye
polarizability: 219.0864019|-7.0088793|159.0213949|-3.5139926|-0.569017|108.3697327 unknown
InChI: InChI=1S/C11H11N3O4/c1-8(15)10(16)11(17)14(13(2)12-18)9-6-4-3-5-7-9/h3-7H,1-2H3
charge 0 multiplicity 1
29 atoms
O  -0.538149 -1.967866 0.735092
O  -2.550469 -0.209494 -1.378961
O  -4.451971 -1.181112 0.528338
O  -1.338785 3.148604 0.156547
N  0.213376 0.042289 -0.247391
N  -0.197757 1.341817 -0.576014
N  -0.864942 2.011242 0.47904
C  1.63656 -0.19378 -0.117775
C  2.16591 -1.47963 -0.388069
C  2.48758 0.875438 0.253569
C  -0.778773 -0.865703 0.166444
C  3.556295 -1.687758 -0.275543
C  3.877784 0.653871 0.34967
C  -0.091415 1.837558 -1.960875
C  4.417621 -0.626496 0.088558
C  -2.234105 -0.536775 -0.209937
C  -3.310294 -0.811682 0.888548
C  -2.905559 -0.555066 2.323516
H  1.503937 -2.301729 -0.668443
H  2.06767 1.861746 0.474466
H  3.966495 -2.682424 -0.478955
H  4.535791 1.480429 0.637738
H  0.931442 1.675908 -2.337864
H  -0.324686 2.914205 -1.939905
H  -0.825255 1.307952 -2.593076
H  5.496398 -0.795843 0.168751
H  -2.367693 0.407302 2.414005
H  -2.210207 -1.347307 2.659065
H  -3.797198 -0.555496 2.96846
