program: Gaussian 09
title: 000006819
version: EM64L-G09RevD.01
frameworkgroup: C1[X(C18H24O6)]
method: RPBEPBE
basis: SDD
operation: Freq
keyword: #pfreq=noraman
keyword: PBEPBE/SDD
title: #p freq=noraman PBEPBE/SDD
converged: YES YES NO NO
title: Mulliken charges:
elementType: O O O O O O C C C C C C C C C C C C C C C C C C H H H H H H H H H H H H H H H H H H H H H H H H
charge: -0.279397 -0.265830 -0.253889 -0.249235 -0.245032 -0.227963 -0.362892 -0.366977 -0.344283 -0.346219 -0.292998 -0.266922 -0.693169 -0.684623 0.163421 0.224960 0.185362 -0.363188 -0.375654 0.164458 -0.372296 0.276246 -0.219603 -0.220742 0.187248 0.203717 0.211633 0.209069 0.232942 0.193860 0.197302 0.199145 0.273239 0.232733 0.224726 0.232138 0.202827 0.216045 0.212544 0.212283 0.220630 0.213118 0.272106 0.263961 0.268283 0.258984 0.239024 0.238909
chargesum: 0.00000
title: Mulliken charges with hydrogens summed into heavy atoms:
elementType: O O O O O O C C C C C C C C C C C C C C C C C C
charge: -0.279397 -0.265830 -0.253889 -0.249235 -0.245032 -0.227963 0.028073 0.053725 0.082519 0.050228 0.212973 0.189941 -0.061754 -0.038591 0.163421 0.224960 0.185362 -0.091082 -0.111692 0.164458 0.154971 0.276246 0.019421 0.018167
polarizability: 2.67002868e+02 -3.53974152e+01 1.89417686e+02 5.36238446e+00 9.99710919e+00 2.01193120e+02
1716.lowfreq: -12.3444 -5.7434 0.0005 0.0007 0.0008 0.9953 3.9348 23.8511 26.1684
frequency: -6.9613 23.3249 25.9728 32.6352 33.1105 44.0539 53.3472 65.6002 77.7441 86.9077 92.6377 100.2547 103.8993 107.8468 115.9022 164.2566 176.7078 186.5445 200.4896 221.7315 228.3534 240.7641 242.6052 259.2400 264.0020 277.5467 294.9526 332.2818 363.0256 387.8315 407.4247 415.6393 458.7575 481.7554 524.8699 538.3967 586.4103 638.9152 662.2701 670.9455 700.1613 706.0831 736.6416 740.8479 778.4767 785.1409 785.7658 796.8980 805.7477 826.0596 847.8875 873.9168 898.4189 901.9563 908.1537 915.6172 931.2654 957.2419 968.8152 976.5310 989.4403 1003.8585 1026.2773 1032.5883 1039.0063 1041.5176 1069.1081 1080.5860 1090.2258 1104.1914 1125.4498 1126.8859 1144.0163 1144.4000 1149.6607 1176.4224 1210.9742 1213.7896 1222.5848 1229.4256 1245.7317 1251.7236 1271.3869 1273.7360 1278.3575 1287.4752 1289.9481 1304.9824 1340.6707 1350.8439 1360.6755 1372.9319 1375.1801 1381.4654 1389.5677 1392.7641 1431.4530 1451.3802 1453.3251 1468.1380 1472.2430 1475.0783 1475.8782 1479.1540 1479.2367 1479.7231 1480.5092 1490.4272 1491.1486 1576.3587 1604.2254 1617.9215 1630.4235 1654.1742 2969.8598 2970.4049 2972.7812 2977.2484 2979.7352 2992.8218 3004.0368 3009.9051 3014.2657 3015.8006 3023.1759 3043.1749 3047.5097 3070.2955 3071.5212 3072.0186 3079.1604 3081.3061 3089.1619 3092.7651 3138.0997 3150.9667 3162.7031 3173.8943
redmass: 3.9272 4.6982 3.5490 5.6070 4.6478 4.4881 4.7444 3.4669 2.3230 2.5569 3.0030 3.1363 2.2546 5.0890 4.0096 3.9786 4.5969 4.8373 3.3917 1.2167 4.7778 1.1857 3.6341 5.4306 3.4475 2.4871 7.1161 3.9480 5.2422 8.7522 3.0560 3.8276 4.0282 3.0114 4.2016 4.4037 4.5613 6.5982 7.7848 6.1023 5.3743 4.6653 1.3755 1.0691 3.6542 1.4818 3.9242 1.1399 2.6061 2.5981 3.0626 5.4180 1.8249 2.2516 1.9159 2.7204 1.1651 1.2801 4.1016 1.4501 2.5426 1.3584 2.8934 3.4338 6.2747 3.5105 2.1014 2.2434 2.8544 2.1030 2.6325 2.1743 2.0375 1.9941 1.7080 1.0604 1.2361 1.3272 1.7011 1.7048 1.3944 2.8353 1.2908 1.1629 1.5626 1.0807 1.1169 1.2684 1.3814 1.5669 1.5345 1.5645 1.6004 6.5268 1.2195 1.2176 2.2691 1.0819 1.0826 1.0821 1.0660 2.0859 1.0425 1.0429 1.0482 1.1889 1.0691 1.0901 1.0902 7.2748 6.4573 11.0492 11.7885 10.3362 1.0420 1.0589 1.0537 1.0364 1.0628 1.0599 1.0568 1.0595 1.1004 1.0701 1.0843 1.1008 1.1036 1.1014 1.0991 1.1029 1.0994 1.1064 1.1014 1.1074 1.0860 1.0902 1.0949 1.1008
irintensity: 0.1246 0.4138 0.2286 2.6678 0.4745 0.8360 1.1636 0.1831 0.3914 0.7431 0.4060 4.5941 0.3140 0.0207 0.9305 2.2838 0.6050 3.9651 8.7737 0.9169 14.3901 1.1513 5.8299 1.4904 3.0244 9.6399 0.6796 0.9340 3.5368 9.5272 14.0344 2.9969 0.7035 4.4589 2.5644 2.5854 16.3097 3.0737 2.6061 1.3659 39.6644 48.3387 4.8681 9.1103 2.0506 46.7407 4.3982 0.3469 15.2376 3.6726 4.9449 3.8065 2.5237 17.1128 1.4621 14.0280 0.4361 8.2612 31.2598 3.2141 4.6878 2.7542 9.7414 206.2874 140.2168 90.4275 14.2345 46.9877 269.2095 98.1271 1.9360 7.2358 154.9725 73.4923 75.8219 0.2393 75.7453 16.7626 14.6477 12.0519 52.5877 278.8986 2.1131 0.0312 14.2173 0.1599 0.7836 3.3007 34.8357 73.7570 0.0723 5.7480 1.9828 9.8094 10.3811 8.9907 6.6772 11.8750 19.2297 0.8748 0.4559 6.5727 9.0946 11.9199 11.2658 9.8402 5.0736 19.9430 11.8589 1.3178 47.8621 295.5551 70.8019 194.6261 26.3512 25.9703 28.0602 34.4262 58.4966 16.8738 34.4748 26.5093 6.7885 27.3120 12.6306 8.9799 2.6923 80.8801 46.3191 12.5396 47.0708 103.4064 7.3222 3.8112 1.7092 5.8338 5.8422 23.2211
temp: 298.150 k
press: 1.00000 atm
elementType: 8 8 8 8 8 8 6 6 6 6 6 6 6 6 6 6 6 6 6 6 6 6 6 6 1 1 1 1 1 1 1 1 1 1 1 1 1 1 1 1 1 1 1 1 1 1 1 1
symmnumber: 1
zpe: 1021801.3 jmol-1
zpe.correction: 0.389184 hartree
zpe.thermalcorrener: 0.414667 hartree
zpe.thermalcorrenthalpy: 0.415611 hartree
zpe.thermalcorrgfe: 0.330336 hartree
zpe.sumelectzpe: -1149.838884 hartree
zpe.sumelectthermal: -1149.813401 hartree
zpe.sumelectthermalent: -1149.812457 hartree
zpe.sumelectthermalfe: -1149.897732 hartree
dipole: -2.3741 -0.9887 -1.1545
dipole: 2.8190
quadrupole: -109.1839 -133.4483 -154.2112
quadrupole: -7.7773 -1.3982 4.3671
quadrupole: 23.0972 -1.1672 -21.9301 -7.7773 -1.3982 4.3671
hfenergy: -1150.228068 hartree
pointgroup: C01 [X(C18H24O6)]
dipole: 0.9426848 -0.3022402 0.5000527 debye
polarizability: 264.5132476|38.3941435|189.746958|1.7356512|-8.1721077|203.3534681 unknown
InChI: InChI=1S/C18H24O6/c1-3-5-11-22-16(19)13-24-18(21)15-10-8-7-9-14(15)17(20)23-12-6-4-2/h7-10H,3-6,11-13H2,1-2H3
charge 0 multiplicity 1
48 atoms
O  -1.750791 1.216857 -0.871565
O  3.285549 -0.483209 0.601536
O  -0.253704 -0.739291 0.688706
O  -2.044304 -0.126637 -2.76088
O  -1.353499 0.106153 2.567578
O  1.803379 0.590095 -0.843785
C  -0.954855 3.52124 -0.898356
C  5.691342 -0.722541 0.302986
C  -0.246712 3.438364 0.473519
C  6.933149 -0.430265 -0.573645
C  -0.962216 2.205757 -1.678089
C  4.418848 -0.154333 -0.322523
C  -0.218447 4.798223 1.202783
C  8.230773 -0.995469 0.042247
C  -2.935588 -0.830386 -0.600063
C  -2.637497 -0.969608 0.784413
C  -2.181511 0.07457 -1.52979
C  -4.057158 -1.505775 -1.139907
C  -3.507611 -1.718182 1.615728
C  -1.402941 -0.433518 1.438631
C  1.027745 -0.360802 1.314264
C  2.027978 -0.030027 0.216691
C  -4.901057 -2.276557 -0.313314
C  -4.636862 -2.366566 1.072736
H  -0.443326 4.276414 -1.530979
H  -1.996616 3.872648 -0.761065
H  5.576803 -1.815034 0.438633
H  5.832315 -0.284666 1.309846
H  -0.764598 2.689265 1.102054
H  0.78817 3.070466 0.320014
H  7.036989 0.664752 -0.715014
H  6.783737 -0.863443 -1.583387
H  0.048955 1.780117 -1.797814
H  -1.444413 2.301464 -2.667597
H  4.461905 0.944527 -0.441085
H  4.197255 -0.600852 -1.309204
H  0.317379 5.561641 0.60653
H  0.285925 4.719546 2.183374
H  -1.244021 5.172244 1.382921
H  8.420371 -0.557081 1.039885
H  9.105974 -0.776312 -0.59563
H  8.167027 -2.092917 0.164003
H  -4.258346 -1.40033 -2.210671
H  -3.279119 -1.796017 2.68347
H  0.876124 0.515917 1.972691
H  1.395471 -1.200672 1.925873
H  -5.766894 -2.790063 -0.744301
H  -5.298175 -2.94641 1.725053
